{"text_format":"1","workbook":"xlsx","n_sheets":3,"sheets":["Painel","Tutorial","Tabela de Tarifas"],"not_rendered":{"charts":0,"images":20,"macros":1,"external_links":0,"defined_names":0,"comments":0,"pivot_tables":0},"unopened":[],"bounds":{"document_bytes":16777216,"sheet_cells":100000,"rows_first":2000,"rows_last":500,"rows_between":2000,"halvings":0,"cell_chars":16384,"cell_head_chars":4096},"cells_cut":0,"cells_raw":0,"read":"whole","date_system":"1900"}

{"sheet":"Painel","index":0,"n_rows":86,"n_cols":26,"rows_kept":86,"cut":false,"hidden":false,"merged":[[28,1,28,5],[43,6,43,8],[44,6,45,6],[44,7,44,8],[43,9,43,11],[44,9,45,9],[44,10,44,11],[42,0,45,0],[42,1,45,1],[43,2,43,5],[44,3,44,4],[44,2,45,2],[10,4,10,5],[10,7,10,8],[22,2,22,12],[23,2,23,6],[14,4,14,5],[14,7,14,8],[14,9,14,10],[14,11,14,12],[16,2,19,5],[20,2,21,12],[13,4,13,5],[13,7,13,8],[13,9,13,10],[13,11,13,12],[11,4,11,5],[11,7,11,8],[11,9,11,10],[11,11,11,12],[12,4,12,5],[12,7,12,8],[12,9,12,10],[12,11,12,12],[10,9,10,10],[10,11,10,12],[2,2,2,12],[4,1,4,3],[4,4,4,6],[6,1,6,3],[8,1,8,3],[8,4,8,5],[8,7,8,8],[8,9,8,10],[8,11,8,12],[9,1,9,3],[9,4,9,5],[9,7,9,8],[9,9,9,10],[9,11,9,12]]}
[]
[]
[null,null,"Simulador de Faturas"]
[]
[null,"   1 - Digite o volume total consumido (m³)"]
[]
[null,"   2 - Clique no serviço oferecido"]
[]
[null,"   3 - Digite o número de economias* ",null,null,"Categorias",null,"Número de economias","Valor Água",null,"Valor Esgoto",null,"Valor Total"]
[null,"        relativas a cada categoria ",null,null,"Residencial Social",null,null,{"$f":"Painel!D31","v":0},null,{"$f":"SUM(Painel!E31:F31)","v":0},null,{"$f":"SUM(H10:K10)","v":0}]
[null,null,null,null,"Residencial",null,null,{"$f":"Painel!D32","v":0},null,{"$f":"SUM(Painel!E32:F32)","v":0},null,0]
[null,null,null,null,"Comercial",null,null,{"$f":"Painel!D33","v":0},null,{"$f":"SUM(Painel!E33:F33)","v":0},null,0]
[null,null,null,null,"Industrial",null,null,{"$f":"Painel!D34","v":0},null,{"$f":"SUM(Painel!E34:F34)","v":0},null,0]
[null,null,null,null,"Pública",null,null,{"$f":"Painel!D35","v":0},null,{"$f":"SUM(Painel!E35:F35)","v":0},null,0]
[null,null,null,null,"Valor Total",null,{"$f":"SUM(G10:G14)","v":0},{"$f":"SUM(H10:I14)","v":0},null,{"$f":"SUM(J10:K14)","v":0},null,0]
[]
[null,null,"* Economia faz referência ao número de unidades familiares, comerciais ou produtivas que existem para um mesmo hidrômetro/ligação. Existindo em um mesma construção, com hidrômetro único, três famílias e duas lojas, têm-se 3 economias residenciais e 2 economias comerciais para 1 ligação"]
[]
[]
[]
[]
[]
[null,null,"Agência Reguladora de Serviços de Abastecimento de Água e Esgotamento Sanitário do Estado de MG - ARSAE"]
[]
[]
[]
[null,"Serviços","Volume/Economias"]
[null,"Só água",{"$f":"IFERROR(Painel!E5/Painel!G15,0)","v":0}]
[null,"Sem multiplicar pelas economias"]
[null,"Categoria","N° economias","Valor Água","Valor ED","Valor EE"]
[null,{"$f":"Painel!E10","v":"Residencial Social"},{"$f":"Painel!G10","v":0},{"$f":"IF($C31>0,IF(OR($B$28=\"Só água\",$B$28=\"Água e Esgoto\",$B$28=\"Água e Esgoto Estático\"),IF($C$28<=$N48,J48,IF(AND($C$28>$M49,$C$28<=$N49),J49,IF(AND($C$28>$M50,$C$28<=$N50),J50,IF(AND($C$28>$M51,$C$28<=$N51),J51,IF(AND($C$28>$M52,$C$28<=$N52),J52,IF(AND($C$28>$M53,$C$28<=$N53),J53,IF($C$28>$M54,J54,\"Erro\"))))))),0),0)","v":0},{"$f":"IF($C31>0,IF(OR($B$28=\"Água e Esgoto\",$B$28=\"Esgoto\"),IF($C$28<=$N48,K48,IF(AND($C$28>$M49,$C$28<=$N49),K49,IF(AND($C$28>$M50,$C$28<=$N50),K50,IF(AND($C$28>$M51,$C$28<=$N51),K51,IF(AND($C$28>$M52,$C$28<=$N52),K52,IF(AND($C$28>$M53,$C$28<=$N53),K53,IF($C$28>$M54,K54,\"Erro\"))))))),0),0)","v":0},{"$f":"IF($C31>0,IF(OR($B$28=\"Esgoto Estático\",$B$28=\"Água e Esgoto Estático\"),IF($C$28<=$N48,L48,IF(AND($C$28>$M49,$C$28<=$N49),L49,IF(AND($C$28>$M50,$C$28<=$N50),L50,IF(AND($C$28>$M51,$C$28<=$N51),L51,IF(AND($C$28>$M52,$C$28<=$N52),L52,IF(AND($C$28>$M53,$C$28<=$N53),L53,IF($C$28>$M54,L54,\"Erro\"))))))),0),0)","v":0}]
[null,{"$f":"Painel!E11","v":"Residencial"},{"$f":"Painel!G11","v":0},{"$f":"IF($C32>0,IF(OR($B$28=\"Só água\",$B$28=\"Água e Esgoto\",$B$28=\"Água e Esgoto Estático\"),IF($C$28<=$N56,J56,IF(AND($C$28>$M57,$C$28<=$N57),J57,IF(AND($C$28>$M58,$C$28<=$N58),J58,IF(AND($C$28>$M59,$C$28<=$N59),J59,IF(AND($C$28>$M60,$C$28<=$N60),J60,IF(AND($C$28>$M61,$C$28<=$N61),J61,IF($C$28>$M62,J62,\"Erro\"))))))),0),0)","v":0},{"$f":"IF($C32>0,IF(OR($B$28=\"Água e Esgoto\",$B$28=\"Esgoto\"),IF($C$28<=$N56,K56,IF(AND($C$28>$M57,$C$28<=$N57),K57,IF(AND($C$28>$M58,$C$28<=$N58),K58,IF(AND($C$28>$M59,$C$28<=$N59),K59,IF(AND($C$28>$M60,$C$28<=$N60),K60,IF(AND($C$28>$M61,$C$28<=$N61),K61,IF($C$28>$M62,K62,\"Erro\"))))))),0),0)","v":0},{"$f":"IF($C32>0,IF(OR($B$28=\"Esgoto Estático\",$B$28=\"Água e Esgoto Estático\"),IF($C$28<=$N56,L56,IF(AND($C$28>$M57,$C$28<=$N57),L57,IF(AND($C$28>$M58,$C$28<=$N58),L58,IF(AND($C$28>$M59,$C$28<=$N59),L59,IF(AND($C$28>$M60,$C$28<=$N60),L60,IF(AND($C$28>$M61,$C$28<=$N61),L61,IF($C$28>$M62,L62,\"Erro\"))))))),0),0)","v":0}]
[null,{"$f":"Painel!E12","v":"Comercial"},{"$f":"Painel!G12","v":0},{"$f":"IF($C33>0,IF(OR($B$28=\"Só água\",$B$28=\"Água e Esgoto\",$B$28=\"Água e Esgoto Estático\"),IF($C$28<=$N64,J64,IF(AND($C$28>$M65,$C$28<=$N65),J65,IF(AND($C$28>$M66,$C$28<=$N66),J66,IF(AND($C$28>$M67,$C$28<=$N67),J67,IF(AND($C$28>$M68,$C$28<=$N68),J68,IF(AND($C$28>$M69,$C$28<=$N69),J69,IF($C$28>$M70,J70,\"Erro\"))))))),0),0)","v":0},{"$f":"IF($C33>0,IF(OR($B$28=\"Água e Esgoto\",$B$28=\"Esgoto\"),IF($C$28<=$N64,K64,IF(AND($C$28>$M65,$C$28<=$N65),K65,IF(AND($C$28>$M66,$C$28<=$N66),K66,IF(AND($C$28>$M67,$C$28<=$N67),K67,IF(AND($C$28>$M68,$C$28<=$N68),K68,IF(AND($C$28>$M69,$C$28<=$N69),K69,IF($C$28>$M70,K70,\"Erro\"))))))),0),0)","v":0},{"$f":"IF($C33>0,IF(OR($B$28=\"Esgoto Estático\",$B$28=\"Água e Esgoto Estático\"),IF($C$28<=$N64,L64,IF(AND($C$28>$M65,$C$28<=$N65),L65,IF(AND($C$28>$M66,$C$28<=$N66),L66,IF(AND($C$28>$M67,$C$28<=$N67),L67,IF(AND($C$28>$M68,$C$28<=$N68),L68,IF(AND($C$28>$M69,$C$28<=$N69),L69,IF($C$28>$M70,L70,\"Erro\"))))))),0),0)","v":0}]
[null,{"$f":"Painel!E13","v":"Industrial"},{"$f":"Painel!G13","v":0},{"$f":"IF($C34>0,IF(OR($B$28=\"Só água\",$B$28=\"Água e Esgoto\",$B$28=\"Água e Esgoto Estático\"),IF($C$28<=$N72,J72,IF(AND($C$28>$M73,$C$28<=$N73),J73,IF(AND($C$28>$M74,$C$28<=$N74),J74,IF(AND($C$28>$M75,$C$28<=$N75),J75,IF(AND($C$28>$M76,$C$28<=$N76),J76,IF(AND($C$28>$M77,$C$28<=$N77),J77,IF($C$28>$M78,J78,\"Erro\"))))))),0),0)","v":0},{"$f":"IF($C34>0,IF(OR($B$28=\"Água e Esgoto\",$B$28=\"Esgoto\"),IF($C$28<=$N72,K72,IF(AND($C$28>$M73,$C$28<=$N73),K73,IF(AND($C$28>$M74,$C$28<=$N74),K74,IF(AND($C$28>$M75,$C$28<=$N75),K75,IF(AND($C$28>$M76,$C$28<=$N76),K76,IF(AND($C$28>$M77,$C$28<=$N77),K77,IF($C$28>$M78,K78,\"Erro\"))))))),0),0)","v":0},{"$f":"IF($C34>0,IF(OR($B$28=\"Esgoto Estático\",$B$28=\"Água e Esgoto Estático\"),IF($C$28<=$N72,L72,IF(AND($C$28>$M73,$C$28<=$N73),L73,IF(AND($C$28>$M74,$C$28<=$N74),L74,IF(AND($C$28>$M75,$C$28<=$N75),L75,IF(AND($C$28>$M76,$C$28<=$N76),L76,IF(AND($C$28>$M77,$C$28<=$N77),L77,IF($C$28>$M78,L78,\"Erro\"))))))),0),0)","v":0}]
[null,{"$f":"Painel!E14","v":"Pública"},{"$f":"Painel!G14","v":0},{"$f":"IF($C35>0,IF(OR($B$28=\"Só água\",$B$28=\"Água e Esgoto\",$B$28=\"Água e Esgoto Estático\"),IF($C$28<=$N80,J80,IF(AND($C$28>$M81,$C$28<=$N81),J81,IF(AND($C$28>$M82,$C$28<=$N82),J82,IF(AND($C$28>$M83,$C$28<=$N83),J83,IF(AND($C$28>$M84,$C$28<=$N84),J84,IF(AND($C$28>$M85,$C$28<=$N85),J85,IF($C$28>$M86,J86,\"Erro\"))))))),0),0)","v":0},{"$f":"IF($C35>0,IF(OR($B$28=\"Água e Esgoto\",$B$28=\"Esgoto\"),IF($C$28<=$N80,K80,IF(AND($C$28>$M81,$C$28<=$N81),K81,IF(AND($C$28>$M82,$C$28<=$N82),K82,IF(AND($C$28>$M83,$C$28<=$N83),K83,IF(AND($C$28>$M84,$C$28<=$N84),K84,IF(AND($C$28>$M85,$C$28<=$N85),K85,IF($C$28>$M86,K86,\"Erro\"))))))),0),0)","v":0},{"$f":"IF($C35>0,IF(OR($B$28=\"Esgoto Estático\",$B$28=\"Água e Esgoto Estático\"),IF($C$28<=$N80,L80,IF(AND($C$28>$M81,$C$28<=$N81),L81,IF(AND($C$28>$M82,$C$28<=$N82),L82,IF(AND($C$28>$M83,$C$28<=$N83),L83,IF(AND($C$28>$M84,$C$28<=$N84),L84,IF(AND($C$28>$M85,$C$28<=$N85),L85,IF($C$28>$M86,L86,\"Erro\"))))))),0),0)","v":0}]
[]
[null,"Tabela Serviços"]
[null,"Só água"]
[null,"Água e Esgoto"]
[null,"Esgoto"]
[null,"Água e Esgoto Estático"]
[null,"Esgoto Estático"]
["Intervalo","Intervalo de Consumo m³",null,null,null,null,null,null,null,null,null,null,null,null,null,null,null,"Tarifa Fixa",0,1,"-","-",9.7100000000000009,"-",7.18,{"$f":"W43+Y43","v":16.89}]
[null,null," Tarifas",null,null,null,"Acumulado",null,null,"Cálculos",null,null,null,null,null,null,null,"0 a 3",3,1,3,{"$f":"C56","v":1.42},{"$f":"V44*3","v":4.26},{"$f":"D56","v":1.05},{"$f":"X44*3","v":3.1500000000000004},{"$f":"W44+Y44","v":7.41}]
[null,null,"Água","Esgoto",null,null,"Água","Esgoto",null,"Água","Esgoto",null,null,null,null,null,null,"3 a 6",2,1,2,{"$f":"C57","v":1.778},{"$f":"V45*2","v":3.556},{"$f":"D57","v":1.3160000000000001},{"$f":"X45*2","v":2.6320000000000001},{"$f":"W45+Y45","v":6.1880000000000006}]
[null,null,null,"ED","EE",null,null,"ED","EE",null,"ED","EE","Referência Min.","Referência Max."]
[null,"Fixa",4.3600000000000003,3.24,1.32,"R$/mês",{"$f":"C47","v":4.3600000000000003},{"$f":"D47","v":3.24},{"$f":"E47","v":1.32},null,null,null,null,null,null,null,null,"Soma",5,1,5,null,{"$f":"W43+W44+W45","v":17.526},null,{"$f":"Y43+Y44+Y45","v":12.962},{"$f":"Z43+Z44+Z45","v":30.488}]
[{"$f":"#REF!-#REF!","v":{"$error":"#REF!"}},"0 a 3 m³",0.71,0.53,0.21,"R$/m³",{"$f":"G47+(C48*$A48)","v":{"$error":"#REF!"}},{"$f":"H47+(D48*$A48)","v":{"$error":"#REF!"}},{"$f":"I47+(E48*$A48)","v":{"$error":"#REF!"}},{"$f":"IF($C$28<=$N48,(($C$28-$M48)*C48)+C$47,\"Fora da faixa\")","v":4.3600000000000003},{"$f":"IF($C$28<=$N48,(($C$28-$M48)*D48)+D$47,\"Fora da faixa\")","v":3.24},{"$f":"IF($C$28<=$N48,(($C$28-$M48)*E48)+E$47,\"Fora da faixa\")","v":1.32},0,3]
[{"$f":"#REF!-#REF!","v":{"$error":"#REF!"}},"> 3 a 6 m³",0.88800000000000001,0.65800000000000003,0.26700000000000002,"R$/m³",{"$f":"G48+(C49*$A49)","v":{"$error":"#REF!"}},{"$f":"H48+(D49*$A49)","v":{"$error":"#REF!"}},{"$f":"I48+(E49*$A49)","v":{"$error":"#REF!"}},{"$f":"IF(AND($C$28>$M49,$C$28<=$N49),(($C$28-$M49)*C49)+G48,\"Fora da faixa\")","v":"Fora da faixa"},{"$f":"IF(AND($C$28>$M49,$C$28<$N49),(($C$28-$M49)*D49)+H48,\"Fora da faixa\")","v":"Fora da faixa"},{"$f":"IF(AND($C$28>$M49,$C$28<$N49),(($C$28-$M49)*E49)+I48,\"Fora da faixa\")","v":"Fora da faixa"},3,6,null,null,null,"ABASTECIMENTO DE ÁGUA",null,null,null,null,null,{"$f":"W47","v":17.526}]
[{"$f":"#REF!-#REF!","v":{"$error":"#REF!"}},"> 6 a 10 m³",1.895,1.4019999999999999,0.56899999999999995,"R$/m³",{"$f":"G49+(C50*$A50)","v":{"$error":"#REF!"}},{"$f":"H49+(D50*$A50)","v":{"$error":"#REF!"}},{"$f":"I49+(E50*$A50)","v":{"$error":"#REF!"}},{"$f":"IF(AND($C$28>$M50,$C$28<=$N50),(($C$28-$M50)*C50)+G49,\"Fora da faixa\")","v":"Fora da faixa"},{"$f":"IF(AND($C$28>$M50,$C$28<=$N50),(($C$28-$M50)*D50)+H49,\"Fora da faixa\")","v":"Fora da faixa"},{"$f":"IF(AND($C$28>$M50,$C$28<=$N50),(($C$28-$M50)*E50)+I49,\"Fora da faixa\")","v":"Fora da faixa"},6,10,null,null,null,"ESGOTO DINÂMICO COM COLETA E TRATAMENTO - EDT",null,null,null,null,null,{"$f":"Y47","v":12.962}]
[{"$f":"#REF!-#REF!","v":{"$error":"#REF!"}},"> 10 a 15 m³",2.9380000000000002,2.1739999999999999,0.88200000000000001,"R$/m³",{"$f":"G50+(C51*$A51)","v":{"$error":"#REF!"}},{"$f":"H50+(D51*$A51)","v":{"$error":"#REF!"}},{"$f":"I50+(E51*$A51)","v":{"$error":"#REF!"}},{"$f":"IF(AND($C$28>$M51,$C$28<=$N51),(($C$28-$M51)*C51)+G50,\"Fora da faixa\")","v":"Fora da faixa"},{"$f":"IF(AND($C$28>$M51,$C$28<=$N51),(($C$28-$M51)*D51)+H50,\"Fora da faixa\")","v":"Fora da faixa"},{"$f":"IF(AND($C$28>$M51,$C$28<=$N51),(($C$28-$M51)*E51)+I50,\"Fora da faixa\")","v":"Fora da faixa"},10,15]
[{"$f":"#REF!-#REF!","v":{"$error":"#REF!"}},"> 15 a 20 m³",4.0090000000000003,2.9670000000000001,1.2030000000000001,"R$/m³",{"$f":"G51+(C52*$A52)","v":{"$error":"#REF!"}},{"$f":"H51+(D52*$A52)","v":{"$error":"#REF!"}},{"$f":"I51+(E52*$A52)","v":{"$error":"#REF!"}},{"$f":"IF(AND($C$28>$M52,$C$28<=$N52),(($C$28-$M52)*C52)+G51,\"Fora da faixa\")","v":"Fora da faixa"},{"$f":"IF(AND($C$28>$M52,$C$28<=$N52),(($C$28-$M52)*D52)+H51,\"Fora da faixa\")","v":"Fora da faixa"},{"$f":"IF(AND($C$28>$M52,$C$28<=$N52),(($C$28-$M52)*E52)+I51,\"Fora da faixa\")","v":"Fora da faixa"},15,20,null,null,null,{"$f":"Z47","v":30.488}]
[{"$f":"#REF!-#REF!","v":{"$error":"#REF!"}},"> 20 a 40 m³",10.201000000000001,7.548,3.06,"R$/m³",{"$f":"G52+(C53*$A53)","v":{"$error":"#REF!"}},{"$f":"H52+(D53*$A53)","v":{"$error":"#REF!"}},{"$f":"I52+(E53*$A53)","v":{"$error":"#REF!"}},{"$f":"IF(AND($C$28>$M53,$C$28<=$N53),(($C$28-$M53)*C53)+G52,\"Fora da faixa\")","v":"Fora da faixa"},{"$f":"IF(AND($C$28>$M53,$C$28<=$N53),(($C$28-$M53)*D53)+H52,\"Fora da faixa\")","v":"Fora da faixa"},{"$f":"IF(AND($C$28>$M53,$C$28<=$N53),(($C$28-$M53)*E53)+I52,\"Fora da faixa\")","v":"Fora da faixa"},20,40]
[null,"> 40 m³",12.446,9.2089999999999996,3.7349999999999999,"R$/m³",null,null,null,{"$f":"IF($C$28>$M54,(($C$28-$M54)*C54)+G53,\"Fora da faixa\")","v":"Fora da faixa"},{"$f":"IF($C$28>$M54,(($C$28-$M54)*D54)+H53,\"Fora da faixa\")","v":"Fora da faixa"},{"$f":"IF($C$28>$M54,(($C$28-$M54)*E54)+I53,\"Fora da faixa\")","v":"Fora da faixa"},40]
[null,"Fixa",9.7100000000000009,7.18,2.91,"R$/mês",{"$f":"C55","v":9.7100000000000009},{"$f":"D55","v":7.18},{"$f":"E55","v":2.91}]
[{"$f":"#REF!-#REF!","v":{"$error":"#REF!"}},"0 a 3 m³",1.42,1.05,0.42,"R$/m³",{"$f":"G55+(C56*$A56)","v":{"$error":"#REF!"}},{"$f":"H55+(D56*$A56)","v":{"$error":"#REF!"}},{"$f":"I55+(E56*$A56)","v":{"$error":"#REF!"}},{"$f":"IF($C$28<=$N56,(($C$28-$M56)*C56)+C$55,\"Fora da faixa\")","v":9.7100000000000009},{"$f":"IF($C$28<=$N56,(($C$28-$M56)*D56)+D$55,\"Fora da faixa\")","v":7.18},{"$f":"IF($C$28<=$N56,(($C$28-$M56)*E56)+E$55,\"Fora da faixa\")","v":2.91},0,3]
[{"$f":"#REF!-#REF!","v":{"$error":"#REF!"}},"> 3 a 6 m³",1.778,1.3160000000000001,0.53300000000000003,"R$/m³",{"$f":"G56+(C57*$A57)","v":{"$error":"#REF!"}},{"$f":"H56+(D57*$A57)","v":{"$error":"#REF!"}},{"$f":"I56+(E57*$A57)","v":{"$error":"#REF!"}},{"$f":"IF(AND($C$28>$M57,$C$28<=$N57),(($C$28-$M57)*C57)+G56,\"Fora da faixa\")","v":"Fora da faixa"},{"$f":"IF(AND($C$28>$M57,$C$28<=$N57),(($C$28-$M57)*D57)+H56,\"Fora da faixa\")","v":"Fora da faixa"},{"$f":"IF(AND($C$28>$M57,$C$28<=$N57),(($C$28-$M57)*E57)+I56,\"Fora da faixa\")","v":"Fora da faixa"},3,6]
[{"$f":"#REF!-#REF!","v":{"$error":"#REF!"}},"> 6 a 10 m³",3.7909999999999999,2.806,1.137,"R$/m³",{"$f":"G57+(C58*$A58)","v":{"$error":"#REF!"}},{"$f":"H57+(D58*$A58)","v":{"$error":"#REF!"}},{"$f":"I57+(E58*$A58)","v":{"$error":"#REF!"}},{"$f":"IF(AND($C$28>$M58,$C$28<=$N58),(($C$28-$M58)*C58)+G57,\"Fora da faixa\")","v":"Fora da faixa"},{"$f":"IF(AND($C$28>$M58,$C$28<=$N58),(($C$28-$M58)*D58)+H57,\"Fora da faixa\")","v":"Fora da faixa"},{"$f":"IF(AND($C$28>$M58,$C$28<=$N58),(($C$28-$M58)*E58)+I57,\"Fora da faixa\")","v":"Fora da faixa"},6,10]
[{"$f":"#REF!-#REF!","v":{"$error":"#REF!"}},"> 10 a 15 m³",5.875,4.3479999999999999,1.7629999999999999,"R$/m³",{"$f":"G58+(C59*$A59)","v":{"$error":"#REF!"}},{"$f":"H58+(D59*$A59)","v":{"$error":"#REF!"}},{"$f":"I58+(E59*$A59)","v":{"$error":"#REF!"}},{"$f":"IF(AND($C$28>$M59,$C$28<=$N59),(($C$28-$M59)*C59)+G58,\"Fora da faixa\")","v":"Fora da faixa"},{"$f":"IF(AND($C$28>$M59,$C$28<=$N59),(($C$28-$M59)*D59)+H58,\"Fora da faixa\")","v":"Fora da faixa"},{"$f":"IF(AND($C$28>$M59,$C$28<=$N59),(($C$28-$M59)*E59)+I58,\"Fora da faixa\")","v":"Fora da faixa"},10,15]
[{"$f":"#REF!-#REF!","v":{"$error":"#REF!"}},"> 15 a 20 m³",8.02,5.9340000000000002,2.4060000000000001,"R$/m³",{"$f":"G59+(C60*$A60)","v":{"$error":"#REF!"}},{"$f":"H59+(D60*$A60)","v":{"$error":"#REF!"}},{"$f":"I59+(E60*$A60)","v":{"$error":"#REF!"}},{"$f":"IF(AND($C$28>$M60,$C$28<=$N60),(($C$28-$M60)*C60)+G59,\"Fora da faixa\")","v":"Fora da faixa"},{"$f":"IF(AND($C$28>$M60,$C$28<=$N60),(($C$28-$M60)*D60)+H59,\"Fora da faixa\")","v":"Fora da faixa"},{"$f":"IF(AND($C$28>$M60,$C$28<=$N60),(($C$28-$M60)*E60)+I59,\"Fora da faixa\")","v":"Fora da faixa"},15,20]
[{"$f":"#REF!-#REF!","v":{"$error":"#REF!"}},"> 20 a 40 m³",10.201000000000001,7.548,3.06,"R$/m³",{"$f":"G60+(C61*$A61)","v":{"$error":"#REF!"}},{"$f":"H60+(D61*$A61)","v":{"$error":"#REF!"}},{"$f":"I60+(E61*$A61)","v":{"$error":"#REF!"}},{"$f":"IF(AND($C$28>$M61,$C$28<=$N61),(($C$28-$M61)*C61)+G60,\"Fora da faixa\")","v":"Fora da faixa"},{"$f":"IF(AND($C$28>$M61,$C$28<=$N61),(($C$28-$M61)*D61)+H60,\"Fora da faixa\")","v":"Fora da faixa"},{"$f":"IF(AND($C$28>$M61,$C$28<=$N61),(($C$28-$M61)*E61)+I60,\"Fora da faixa\")","v":"Fora da faixa"},20,40]
[null,"> 40 m³",12.446,9.2089999999999996,3.7349999999999999,"R$/m³",null,null,null,{"$f":"IF($C$28>$M62,(($C$28-$M62)*C62)+G61,\"Fora da faixa\")","v":"Fora da faixa"},{"$f":"IF($C$28>$M62,(($C$28-$M62)*D62)+H61,\"Fora da faixa\")","v":"Fora da faixa"},{"$f":"IF($C$28>$M62,(($C$28-$M62)*E62)+I61,\"Fora da faixa\")","v":"Fora da faixa"},40]
[null,"Fixa",23.35,17.28,7.01,"R$/mês",{"$f":"C63","v":23.35},{"$f":"D63","v":17.28},{"$f":"E63","v":7.01}]
[{"$f":"#REF!-#REF!","v":{"$error":"#REF!"}},"0 a 3 m³",2.85,2.1,0.85,"R$/m³",{"$f":"G63+(C64*$A64)","v":{"$error":"#REF!"}},{"$f":"H63+(D64*$A64)","v":{"$error":"#REF!"}},{"$f":"I63+(E64*$A64)","v":{"$error":"#REF!"}},{"$f":"IF($C$28<=$N64,(($C$28-$M64)*C64)+C$63,\"Fora da faixa\")","v":23.35},{"$f":"IF($C$28<=$N64,(($C$28-$M64)*D64)+D$63,\"Fora da faixa\")","v":17.28},{"$f":"IF($C$28<=$N64,(($C$28-$M64)*E64)+E$63,\"Fora da faixa\")","v":7.01},0,3]
[{"$f":"#REF!-#REF!","v":{"$error":"#REF!"}},"> 3 a 6 m³",4.2679999999999998,3.1579999999999999,1.28,"R$/m³",{"$f":"G64+(C65*$A65)","v":{"$error":"#REF!"}},{"$f":"H64+(D65*$A65)","v":{"$error":"#REF!"}},{"$f":"I64+(E65*$A65)","v":{"$error":"#REF!"}},{"$f":"IF(AND($C$28>$M65,$C$28<=$N65),(($C$28-$M65)*C65)+G64,\"Fora da faixa\")","v":"Fora da faixa"},{"$f":"IF(AND($C$28>$M65,$C$28<=$N65),(($C$28-$M65)*D65)+H64,\"Fora da faixa\")","v":"Fora da faixa"},{"$f":"IF(AND($C$28>$M65,$C$28<=$N65),(($C$28-$M65)*E65)+I64,\"Fora da faixa\")","v":"Fora da faixa"},3,6]
[{"$f":"#REF!-#REF!","v":{"$error":"#REF!"}},"> 6 a 10 m³",6.4009999999999998,4.7370000000000001,1.92,"R$/m³",{"$f":"G65+(C66*$A66)","v":{"$error":"#REF!"}},{"$f":"H65+(D66*$A66)","v":{"$error":"#REF!"}},{"$f":"I65+(E66*$A66)","v":{"$error":"#REF!"}},{"$f":"IF(AND($C$28>$M66,$C$28<=$N66),(($C$28-$M66)*C66)+G65,\"Fora da faixa\")","v":"Fora da faixa"},{"$f":"IF(AND($C$28>$M66,$C$28<=$N66),(($C$28-$M66)*D66)+H65,\"Fora da faixa\")","v":"Fora da faixa"},{"$f":"IF(AND($C$28>$M66,$C$28<=$N66),(($C$28-$M66)*E66)+I65,\"Fora da faixa\")","v":"Fora da faixa"},6,10]
[{"$f":"#REF!-#REF!","v":{"$error":"#REF!"}},"> 10 a 20 m³",8.61,6.3710000000000004,2.5830000000000002,"R$/m³",{"$f":"G66+(C67*$A67)","v":{"$error":"#REF!"}},{"$f":"H66+(D67*$A67)","v":{"$error":"#REF!"}},{"$f":"I66+(E67*$A67)","v":{"$error":"#REF!"}},{"$f":"IF(AND($C$28>$M67,$C$28<=$N67),(($C$28-$M67)*C67)+G66,\"Fora da faixa\")","v":"Fora da faixa"},{"$f":"IF(AND($C$28>$M67,$C$28<=$N67),(($C$28-$M67)*D67)+H66,\"Fora da faixa\")","v":"Fora da faixa"},{"$f":"IF(AND($C$28>$M67,$C$28<=$N67),(($C$28-$M67)*E67)+I66,\"Fora da faixa\")","v":"Fora da faixa"},10,"S"]
[{"$f":"#REF!-#REF!","v":{"$error":"#REF!"}},"> 20 a 40 m³",10.848000000000001,8.0269999999999992,3.2549999999999999,"R$/m³",{"$f":"G67+(C68*$A68)","v":{"$error":"#REF!"}},{"$f":"H67+(D68*$A68)","v":{"$error":"#REF!"}},{"$f":"I67+(E68*$A68)","v":{"$error":"#REF!"}},{"$f":"IF(AND($C$28>$M68,$C$28<=$N68),(($C$28-$M68)*C68)+G67,\"Fora da faixa\")","v":"Fora da faixa"},{"$f":"IF(AND($C$28>$M68,$C$28<=$N68),(($C$28-$M68)*D68)+H67,\"Fora da faixa\")","v":"Fora da faixa"},{"$f":"IF(AND($C$28>$M68,$C$28<=$N68),(($C$28-$M68)*E68)+I67,\"Fora da faixa\")","v":"Fora da faixa"},20,40]
[{"$f":"#REF!-#REF!","v":{"$error":"#REF!"}},"> 40 a 200 m³",13.148999999999999,9.73,3.9449999999999998,"R$/m³",{"$f":"G68+(C69*$A69)","v":{"$error":"#REF!"}},{"$f":"H68+(D69*$A69)","v":{"$error":"#REF!"}},{"$f":"I68+(E69*$A69)","v":{"$error":"#REF!"}},{"$f":"IF(AND($C$28>$M69,$C$28<=$N69),(($C$28-$M69)*C69)+G68,\"Fora da faixa\")","v":"Fora da faixa"},{"$f":"IF(AND($C$28>$M69,$C$28<=$N69),(($C$28-$M69)*D69)+H68,\"Fora da faixa\")","v":"Fora da faixa"},{"$f":"IF(AND($C$28>$M69,$C$28<=$N69),(($C$28-$M69)*E69)+I68,\"Fora da faixa\")","v":"Fora da faixa"},40,200]
[null,"> 200 m³",15.462,11.442,4.6379999999999999,"R$/m³",null,null,null,{"$f":"IF($C$28>$M70,(($C$28-$M70)*C70)+G69,\"Fora da faixa\")","v":"Fora da faixa"},{"$f":"IF($C$28>$M70,(($C$28-$M70)*D70)+H69,\"Fora da faixa\")","v":"Fora da faixa"},{"$f":"IF($C$28>$M70,(($C$28-$M70)*E70)+I69,\"Fora da faixa\")","v":"Fora da faixa"},200]
[null,"Fixa",23.35,17.28,7.01,"R$/mês",{"$f":"C71","v":23.35},{"$f":"D71","v":17.28},{"$f":"E71","v":7.01}]
[{"$f":"#REF!-#REF!","v":{"$error":"#REF!"}},"0 a 3 m³",2.85,2.1,0.85,"R$/m³",{"$f":"G71+(C72*$A72)","v":{"$error":"#REF!"}},{"$f":"H71+(D72*$A72)","v":{"$error":"#REF!"}},{"$f":"I71+(E72*$A72)","v":{"$error":"#REF!"}},{"$f":"IF($C$28<=$N72,(($C$28-$M72)*C72)+C$71,\"Fora da faixa\")","v":23.35},{"$f":"IF($C$28<=$N72,(($C$28-$M72)*D72)+D$71,\"Fora da faixa\")","v":17.28},{"$f":"IF($C$28<=$N72,(($C$28-$M72)*E72)+E$71,\"Fora da faixa\")","v":7.01},0,3]
[{"$f":"#REF!-#REF!","v":{"$error":"#REF!"}},"> 3 a 6 m³",4.2679999999999998,3.1579999999999999,1.28,"R$/m³",{"$f":"G72+(C73*$A73)","v":{"$error":"#REF!"}},{"$f":"H72+(D73*$A73)","v":{"$error":"#REF!"}},{"$f":"I72+(E73*$A73)","v":{"$error":"#REF!"}},{"$f":"IF(AND($C$28>$M73,$C$28<=$N73),(($C$28-$M73)*C73)+G72,\"Fora da faixa\")","v":"Fora da faixa"},{"$f":"IF(AND($C$28>$M73,$C$28<=$N73),(($C$28-$M73)*D73)+H72,\"Fora da faixa\")","v":"Fora da faixa"},{"$f":"IF(AND($C$28>$M73,$C$28<=$N73),(($C$28-$M73)*E73)+I72,\"Fora da faixa\")","v":"Fora da faixa"},3,6]
[{"$f":"#REF!-#REF!","v":{"$error":"#REF!"}},"> 6 a 10 m³",6.4009999999999998,4.7370000000000001,1.92,"R$/m³",{"$f":"G73+(C74*$A74)","v":{"$error":"#REF!"}},{"$f":"H73+(D74*$A74)","v":{"$error":"#REF!"}},{"$f":"I73+(E74*$A74)","v":{"$error":"#REF!"}},{"$f":"IF(AND($C$28>$M74,$C$28<=$N74),(($C$28-$M74)*C74)+G73,\"Fora da faixa\")","v":"Fora da faixa"},{"$f":"IF(AND($C$28>$M74,$C$28<=$N74),(($C$28-$M74)*D74)+H73,\"Fora da faixa\")","v":"Fora da faixa"},{"$f":"IF(AND($C$28>$M74,$C$28<=$N74),(($C$28-$M74)*E74)+I73,\"Fora da faixa\")","v":"Fora da faixa"},6,10]
[{"$f":"#REF!-#REF!","v":{"$error":"#REF!"}},"> 10 a 20 m³",8.61,6.3710000000000004,2.5830000000000002,"R$/m³",{"$f":"G74+(C75*$A75)","v":{"$error":"#REF!"}},{"$f":"H74+(D75*$A75)","v":{"$error":"#REF!"}},{"$f":"I74+(E75*$A75)","v":{"$error":"#REF!"}},{"$f":"IF(AND($C$28>$M75,$C$28<=$N75),(($C$28-$M75)*C75)+G74,\"Fora da faixa\")","v":"Fora da faixa"},{"$f":"IF(AND($C$28>$M75,$C$28<=$N75),(($C$28-$M75)*D75)+H74,\"Fora da faixa\")","v":"Fora da faixa"},{"$f":"IF(AND($C$28>$M75,$C$28<=$N75),(($C$28-$M75)*E75)+I74,\"Fora da faixa\")","v":"Fora da faixa"},10,20]
[{"$f":"#REF!-#REF!","v":{"$error":"#REF!"}},"> 20 a 40 m³",10.848000000000001,8.0269999999999992,3.2549999999999999,"R$/m³",{"$f":"G75+(C76*$A76)","v":{"$error":"#REF!"}},{"$f":"H75+(D76*$A76)","v":{"$error":"#REF!"}},{"$f":"I75+(E76*$A76)","v":{"$error":"#REF!"}},{"$f":"IF(AND($C$28>$M76,$C$28<=$N76),(($C$28-$M76)*C76)+G75,\"Fora da faixa\")","v":"Fora da faixa"},{"$f":"IF(AND($C$28>$M76,$C$28<=$N76),(($C$28-$M76)*D76)+H75,\"Fora da faixa\")","v":"Fora da faixa"},{"$f":"IF(AND($C$28>$M76,$C$28<=$N76),(($C$28-$M76)*E76)+I75,\"Fora da faixa\")","v":"Fora da faixa"},20,40]
[{"$f":"#REF!-#REF!","v":{"$error":"#REF!"}},"> 40 a 200 m³",13.148999999999999,9.73,3.9449999999999998,"R$/m³",{"$f":"G76+(C77*$A77)","v":{"$error":"#REF!"}},{"$f":"H76+(D77*$A77)","v":{"$error":"#REF!"}},{"$f":"I76+(E77*$A77)","v":{"$error":"#REF!"}},{"$f":"IF(AND($C$28>$M77,$C$28<=$N77),(($C$28-$M77)*C77)+G76,\"Fora da faixa\")","v":"Fora da faixa"},{"$f":"IF(AND($C$28>$M77,$C$28<=$N77),(($C$28-$M77)*D77)+H76,\"Fora da faixa\")","v":"Fora da faixa"},{"$f":"IF(AND($C$28>$M77,$C$28<=$N77),(($C$28-$M77)*E77)+I76,\"Fora da faixa\")","v":"Fora da faixa"},40,200]
[null,"> 200 m³",15.462,11.442,4.6379999999999999,"R$/m³",null,null,null,{"$f":"IF($C$28>$M78,(($C$28-$M78)*C78)+G77,\"Fora da faixa\")","v":"Fora da faixa"},{"$f":"IF(AND($C$28>$M78,$C$28<$N78),(($C$28-$M78)*D78)+H77,\"Fora da faixa\")","v":"Fora da faixa"},{"$f":"IF(AND($C$28>$M78,$C$28<$N78),(($C$28-$M78)*E78)+I77,\"Fora da faixa\")","v":"Fora da faixa"},200]
[null,"Fixa",19.850000000000001,14.69,5.96,"R$/mês",{"$f":"C79","v":19.850000000000001},{"$f":"D79","v":14.69},{"$f":"E79","v":5.96}]
[{"$f":"#REF!-#REF!","v":{"$error":"#REF!"}},"0 a 3 m³",2.69,1.99,0.81,"R$/m³",{"$f":"G79+(C80*$A80)","v":{"$error":"#REF!"}},{"$f":"H79+(D80*$A80)","v":{"$error":"#REF!"}},{"$f":"I79+(E80*$A80)","v":{"$error":"#REF!"}},{"$f":"IF($C$28<=$N80,(($C$28-$M80)*C80)+C$79,\"Fora da faixa\")","v":19.850000000000001},{"$f":"IF($C$28<=$N80,(($C$28-$M80)*D80)+D$79,\"Fora da faixa\")","v":14.69},{"$f":"IF($C$28<=$N80,(($C$28-$M80)*E80)+E$79,\"Fora da faixa\")","v":5.96},0,3]
[{"$f":"#REF!-#REF!","v":{"$error":"#REF!"}},"> 3 a 6 m³",4.0430000000000001,2.9910000000000001,1.2130000000000001,"R$/m³",{"$f":"G80+(C81*$A81)","v":{"$error":"#REF!"}},{"$f":"H80+(D81*$A81)","v":{"$error":"#REF!"}},{"$f":"I80+(E81*$A81)","v":{"$error":"#REF!"}},{"$f":"IF(AND($C$28>$M81,$C$28<=$N81),(($C$28-$M81)*C81)+G80,\"Fora da faixa\")","v":"Fora da faixa"},{"$f":"IF(AND($C$28>$M81,$C$28<=$N81),(($C$28-$M81)*D81)+H80,\"Fora da faixa\")","v":"Fora da faixa"},{"$f":"IF(AND($C$28>$M81,$C$28<=$N81),(($C$28-$M81)*E81)+I80,\"Fora da faixa\")","v":"Fora da faixa"},3,6]
[{"$f":"#REF!-#REF!","v":{"$error":"#REF!"}},"> 6 a 10 m³",6.0640000000000001,4.4870000000000001,1.82,"R$/m³",{"$f":"G81+(C82*$A82)","v":{"$error":"#REF!"}},{"$f":"H81+(D82*$A82)","v":{"$error":"#REF!"}},{"$f":"I81+(E82*$A82)","v":{"$error":"#REF!"}},{"$f":"IF(AND($C$28>$M82,$C$28<=$N82),(($C$28-$M82)*C82)+G81,\"Fora da faixa\")","v":"Fora da faixa"},{"$f":"IF(AND($C$28>$M82,$C$28<=$N82),(($C$28-$M82)*D82)+H81,\"Fora da faixa\")","v":"Fora da faixa"},{"$f":"IF(AND($C$28>$M82,$C$28<=$N82),(($C$28-$M82)*E82)+I81,\"Fora da faixa\")","v":"Fora da faixa"},6,10]
[{"$f":"#REF!-#REF!","v":{"$error":"#REF!"}},"> 10 a 20 m³",8.157,6.0369999999999999,2.4470000000000001,"R$/m³",{"$f":"G82+(C83*$A83)","v":{"$error":"#REF!"}},{"$f":"H82+(D83*$A83)","v":{"$error":"#REF!"}},{"$f":"I82+(E83*$A83)","v":{"$error":"#REF!"}},{"$f":"IF(AND($C$28>$M83,$C$28<=$N83),(($C$28-$M83)*C83)+G82,\"Fora da faixa\")","v":"Fora da faixa"},{"$f":"IF(AND($C$28>$M83,$C$28<=$N83),(($C$28-$M83)*D83)+H82,\"Fora da faixa\")","v":"Fora da faixa"},{"$f":"IF(AND($C$28>$M83,$C$28<=$N83),(($C$28-$M83)*E83)+I82,\"Fora da faixa\")","v":"Fora da faixa"},10,20]
[{"$f":"#REF!-#REF!","v":{"$error":"#REF!"}},"> 20 a 40 m³",10.276999999999999,7.6050000000000004,3.0830000000000002,"R$/m³",{"$f":"G83+(C84*$A84)","v":{"$error":"#REF!"}},{"$f":"H83+(D84*$A84)","v":{"$error":"#REF!"}},{"$f":"I83+(E84*$A84)","v":{"$error":"#REF!"}},{"$f":"IF(AND($C$28>$M84,$C$28<=$N84),(($C$28-$M84)*C84)+G83,\"Fora da faixa\")","v":"Fora da faixa"},{"$f":"IF(AND($C$28>$M84,$C$28<=$N84),(($C$28-$M84)*D84)+H83,\"Fora da faixa\")","v":"Fora da faixa"},{"$f":"IF(AND($C$28>$M84,$C$28<=$N84),(($C$28-$M84)*E84)+I83,\"Fora da faixa\")","v":"Fora da faixa"},20,40]
[{"$f":"#REF!-#REF!","v":{"$error":"#REF!"}},"> 40 a 200 m³",12.456,9.218,3.7370000000000001,"R$/m³",{"$f":"G84+(C85*$A85)","v":{"$error":"#REF!"}},{"$f":"H84+(D85*$A85)","v":{"$error":"#REF!"}},{"$f":"I84+(E85*$A85)","v":{"$error":"#REF!"}},{"$f":"IF(AND($C$28>$M85,$C$28<=$N85),(($C$28-$M85)*C85)+G84,\"Fora da faixa\")","v":"Fora da faixa"},{"$f":"IF(AND($C$28>$M85,$C$28<=$N85),(($C$28-$M85)*D85)+H84,\"Fora da faixa\")","v":"Fora da faixa"},{"$f":"IF(AND($C$28>$M85,$C$28<=$N85),(($C$28-$M85)*E85)+I84,\"Fora da faixa\")","v":"Fora da faixa"},40,200]
[null,"> 200 m³",14.648,10.84,4.3949999999999996,"R$/m³",null,null,null,{"$f":"IF($C$28>$M86,(($C$28-$M86)*C86)+G85,\"Fora da faixa\")","v":"Fora da faixa"},{"$f":"IF($C$28>$M86,(($C$28-$M86)*D86)+H85,\"Fora da faixa\")","v":"Fora da faixa"},{"$f":"IF($C$28>$M86,(($C$28-$M86)*E86)+I85,\"Fora da faixa\")","v":"Fora da faixa"},200]

{"sheet":"Tutorial","index":1,"n_rows":5,"n_cols":32,"rows_kept":5,"cut":false,"hidden":false,"merged":[]}
[]
[]
[]
[]
[null,null,null,null,null,null,null,null,null,null,null,null,null,null,null,null,null,null,null,null,null,null,null,null,null,null,null,null,null,null,null,"Exemplo de uso do simulador"]

{"sheet":"Tabela de Tarifas","index":2,"n_rows":43,"n_cols":7,"rows_kept":43,"cut":false,"hidden":false,"merged":[[27,1,34,1],[35,1,42,1],[1,3,1,5],[1,1,1,2],[1,6,2,6],[3,1,10,1],[11,1,18,1],[19,1,26,1]]}
[]
[null,"De Jan 24 até Dez 24",null,"Tarifas",null,null,"Unidade"]
[null,"Categorias","Faixas","Água","ED","EE"]
[null,"Residencial Social","Fixa",4.3600000000000003,3.24,1.32,"R$/mês"]
[null,null,"0 a 3 m³",0.71,0.53,0.21,"R$/m³"]
[null,null,"> 3 a 6 m³",0.88800000000000001,0.65800000000000003,0.26700000000000002,"R$/m³"]
[null,null,"> 6 a 10 m³",1.895,1.4019999999999999,0.56899999999999995,"R$/m³"]
[null,null,"> 10 a 15 m³",2.9380000000000002,2.1739999999999999,0.88200000000000001,"R$/m³"]
[null,null,"> 15 a 20 m³",4.0090000000000003,2.9670000000000001,1.2030000000000001,"R$/m³"]
[null,null,"> 20 a 40 m³",10.201000000000001,7.548,3.06,"R$/m³"]
[null,null,"> 40 m³",12.446,9.2089999999999996,3.7349999999999999,"R$/m³"]
[null,"Residencial","Fixa",9.7100000000000009,7.18,2.91,"R$/mês"]
[null,null,"0 a 3 m³",1.42,1.05,0.42,"R$/m³"]
[null,null,"> 3 a 6 m³",1.778,1.3160000000000001,0.53300000000000003,"R$/m³"]
[null,null,"> 6 a 10 m³",3.7909999999999999,2.806,1.137,"R$/m³"]
[null,null,"> 10 a 15 m³",5.875,4.3479999999999999,1.7629999999999999,"R$/m³"]
[null,null,"> 15 a 20 m³",8.02,5.9340000000000002,2.4060000000000001,"R$/m³"]
[null,null,"> 20 a 40 m³",10.201000000000001,7.548,3.06,"R$/m³"]
[null,null,"> 40 m³",12.446,9.2089999999999996,3.7349999999999999,"R$/m³"]
[null,"Comercial","Fixa",23.35,17.28,7.01,"R$/mês"]
[null,null,"0 a 3 m³",2.85,2.1,0.85,"R$/m³"]
[null,null,"> 3 a 6 m³",4.2679999999999998,3.1579999999999999,1.28,"R$/m³"]
[null,null,"> 6 a 10 m³",6.4009999999999998,4.7370000000000001,1.92,"R$/m³"]
[null,null,"> 10 a 20 m³",8.61,6.3710000000000004,2.5830000000000002,"R$/m³"]
[null,null,"> 20 a 40 m³",10.848000000000001,8.0269999999999992,3.2549999999999999,"R$/m³"]
[null,null,"> 40 a 200 m³",13.148999999999999,9.73,3.9449999999999998,"R$/m³"]
[null,null,"> 200 m³",15.462,11.442,4.6379999999999999,"R$/m³"]
[null,"Industrial","Fixa",23.35,17.28,7.01,"R$/mês"]
[null,null,"0 a 3 m³",2.85,2.1,0.85,"R$/m³"]
[null,null,"> 3 a 6 m³",4.2679999999999998,3.1579999999999999,1.28,"R$/m³"]
[null,null,"> 6 a 10 m³",6.4009999999999998,4.7370000000000001,1.92,"R$/m³"]
[null,null,"> 10 a 20 m³",8.61,6.3710000000000004,2.5830000000000002,"R$/m³"]
[null,null,"> 20 a 40 m³",10.848000000000001,8.0269999999999992,3.2549999999999999,"R$/m³"]
[null,null,"> 40 a 200 m³",13.148999999999999,9.73,3.9449999999999998,"R$/m³"]
[null,null,"> 200 m³",15.462,11.442,4.6379999999999999,"R$/m³"]
[null,"Pública","Fixa",19.850000000000001,14.69,5.96,"R$/mês"]
[null,null,"0 a 3 m³",2.69,1.99,0.81,"R$/m³"]
[null,null,"> 3 a 6 m³",4.0430000000000001,2.9910000000000001,1.2130000000000001,"R$/m³"]
[null,null,"> 6 a 10 m³",6.0640000000000001,4.4870000000000001,1.82,"R$/m³"]
[null,null,"> 10 a 20 m³",8.157,6.0369999999999999,2.4470000000000001,"R$/m³"]
[null,null,"> 20 a 40 m³",10.276999999999999,7.6050000000000004,3.0830000000000002,"R$/m³"]
[null,null,"> 40 a 200 m³",12.456,9.218,3.7370000000000001,"R$/m³"]
[null,null,"> 200 m³",14.648,10.84,4.3949999999999996,"R$/m³"]