{"text_format":"1","workbook":"xlsx","n_sheets":10,"sheets":["Sumário","1 Anterior (IRT_2022)","2.IRT_2023","3. Índices_inflação","3.1 Índice_EE","3.1.3.Tarifas_EE","4.Componentes Financeiros","5.Subsídio_Copanor","5.1.Sub_Copanor_comp","6.Compen_quota_depreciacao"],"not_rendered":{"charts":2,"images":5,"macros":1,"external_links":0,"defined_names":1312,"comments":9,"pivot_tables":0},"unopened":[],"bounds":{"document_bytes":16777216,"sheet_cells":100000,"rows_first":2000,"rows_last":500,"rows_between":2000,"halvings":0,"cell_chars":16384,"cell_head_chars":4096},"cells_cut":0,"cells_raw":0,"read":"whole","date_system":"1900"}

{"sheet":"Sumário","index":0,"n_rows":38,"n_cols":20,"rows_kept":38,"cut":false,"hidden":false,"merged":[[6,1,7,12],[9,1,9,19],[37,1,37,19]]}
["ARSAE-MG "]
["Gerência de Regulação Tarifária (GRT)"]
[{"$f":"TODAY()","v":"2023-11-28"}]
["Cálculo do Índice de Reajuste Tarifário (IRT) e Efeito Tarifário Médio (ETM) - Reajuste Tarifário da Copasa - 2023"]
[]
[]
[null,"    Esta planilha contém cálculos referentes ao reajuste tarifário anual da Copasa - 2023",null,null,null,null,null,null,null,null,null,null,null,null,null,null,null,"PR0:",{"$f":"EDATE(S8,-12)","v":"2023-01-01"},{"$f":"EDATE(S7,11)","v":"2023-12-01"}]
[null,null,null,null,null,null,null,null,null,null,null,null,null,null,null,null,null,"PR1:","2024-01-01",{"$f":"EDATE(S8,11)","v":"2024-12-01"}]
[]
[null,"   Conteúdo das abas principais:"]
{"$rows_left_out":29}
{"sheet":"1 Anterior (IRT_2022)","index":1,"n_rows":71,"n_cols":25,"rows_kept":71,"cut":false,"hidden":false,"merged":[[14,15,14,16],[5,11,5,12],[10,15,10,17],[11,15,11,16],[12,15,12,16],[13,15,13,16],[18,5,18,6],[18,7,18,11],[18,12,18,19],[20,2,39,2],[20,3,33,3],[65,4,65,19],[40,2,43,2],[44,2,47,2],[48,2,53,2],[56,2,61,2],[64,4,64,19]]}
["ARSAE-MG "]
["Gerência de Regulação Tarifária (GRT)",null,null,null,null,null,null,null,null,null,null,"WACC regulatório",null,7.9240410012754392E-2]
["Data: 09/05/2022",null,null,null,null,null,null,null,null,null,null,"NCG (descasamento de prazos pgto/recebimento)",null,3.175509143231408E-2]
["Cálculo do Índice de Reajuste Tarifário (IRT) e Efeito Tarifário Médio (ETM) - Reajuste Tarifário da Copasa - 2022",null,null,null,null,null,null,null,null,null,null,"NCG (estoque de materiais de consumo)",null,1.0964417715997498E-2]
[null,null,null,null,null,null,null,null,null,null,null,"Rendimento médio do caixa no PR0",null,2.232796405477917E-2]
[null,null,null,null,null,null,null,null,null,null,null,"Custos operacionais resíduos sólidos"]
[null,null,null,null,null,null,null,null,null,null,null,"Receita (-) custos do serviço de resíduos sólidos"]
[null,null,null,null,null,null,null,null,null,null,null,"Autosserviços de água e esgoto",null,1.7813658707888306E-3]
[null,null,null,null,null,null,null,null,null,null,null,"PIS/Pasep e Cofins",null,8.445920763529885E-2]
[null,null,null,null,null,null,null,null,null,null,null,"PDI",null,1E-3]
{"$rows_left_out":62}
{"sheet":"2.IRT_2023","index":2,"n_rows":111,"n_cols":25,"rows_kept":111,"cut":false,"hidden":false,"merged":[[65,4,65,19],[56,2,61,2],[48,2,53,2],[4,8,4,10],[18,12,18,19],[18,5,18,6],[18,7,18,11],[10,12,10,14],[64,4,64,19],[6,12,6,14],[7,12,7,13],[2,0,2,1],[20,2,39,2],[40,2,43,2],[20,3,33,3],[44,2,47,2]]}
["ARSAE-MG "]
["Gerência de Regulação Tarifária (GRT)"]
[{"$f":"TODAY()","v":"2023-11-28"}]
[{"$f":"Sumário!A4","v":"Cálculo do Índice de Reajuste Tarifário (IRT) e Efeito Tarifário Médio (ETM) - Reajuste Tarifário da Copasa - 2023"}]
[null,null,null,null,null,null,null,null,"Valores fixos"]
[null,null,null,null,null,null,null,null,"WACC regulatório",null,{"$f":"VLOOKUP(I6,'1 Anterior (IRT_2022)'!$L$2:$N$17,3,FALSE)","v":7.9240410012754392E-2}]
[null,null,null,null,null,null,null,null,"NCG (descasamento de prazos pgto/recebimento)",null,{"$f":"VLOOKUP(I7,'1 Anterior (IRT_2022)'!$L$2:$N$17,3,FALSE)","v":3.175509143231408E-2},null,"Receita para proteção do PPM e PDI"]
[null,null,null,null,null,null,null,null,"NCG (estoque de materiais de consumo)",null,{"$f":"VLOOKUP(I8,'1 Anterior (IRT_2022)'!$L$2:$N$17,3,FALSE)","v":1.0964417715997498E-2},null,"ROL 2023",null,6999206079.4622211]
[null,null,null,null,null,null,null,null,"Rendimento médio do caixa no PR0",null,{"$f":"VLOOKUP(I9,'1 Anterior (IRT_2022)'!$L$2:$N$17,3,FALSE)","v":2.232796405477917E-2}]
[null,null,null,null,null,null,null,null,"Autosserviços de água e esgoto",null,{"$f":"VLOOKUP(I10,'1 Anterior (IRT_2022)'!$L$2:$N$17,3,FALSE)","v":1.7813658707888306E-3}]
{"$rows_left_out":102}
{"sheet":"3. Índices_inflação","index":3,"n_rows":190,"n_cols":53,"rows_kept":190,"cut":false,"hidden":false,"merged":[]}
["Mês","INPC","Δ%","Acum até dez/23","IGP-M","Δ%","Acum até dez/23","IGP-DI","Δ%","Acum até dez/23","INCC","Δ%","Acum até dez/23","INCC-DI MB","Δ%","Acum até dez/23","INCC-DI MS","Δ%","Acum até dez/23","INCC-M","Δ%","Acum até dez/23","SELIC","Δ%","Acum até dez/23","IPCA","Δ%","Acum até dez/23","IPCA 15","Δ%","Acum até dez/23","IPCA BH Fixo","Δ%","IPCA BH Cel","Δ%","IPCA BH Int","Δ%","IPCA BH Gas","Δ%","IPCA BH Die","Δ%","IPCA BH Tel","Δ%","Acum até dez/23","IPCA BH Comb","Δ%","Acum até dez/23","ETM","Δ%","Acum até dez/23","IEE","Δ%","Acum até dez/23"]
["2012-12-01",100,null,null,100,null,null,100,null,null,100,null,null,100,null,null,100,null,null,100,null,null,100,null,null,100,null,null,100,null,null,100,null,100,null,100,null,100,null,100,null,{"$f":"AVERAGE(AF2,AH2,AJ2)","v":100},null,null,{"$f":"0.4*AN2+0.6*AL2","v":100},null,null,100,null,null,"Cálculo mensal a partir de jan/17"]
["2013-01-01",100.92000000000002,{"$f":"B3/B2-1","v":9.200000000000097E-3},{"$f":"B$134/B2-1","v":0.87409122193248212},100.34,{"$f":"E3/E2-1","v":3.4000000000000696E-3},{"$f":"E$134/E2-1","v":1.1946092919304916},100.31000000000002,{"$f":"H3/H2-1","v":3.1000000000001027E-3},{"$f":"H$134/H2-1","v":1.14679178000618},100.64999999999999,{"$f":"K3/K2-1","v":6.4999999999999503E-3},{"$f":"K$134/K2-1","v":1.0861141093335824},100.66,{"$f":"N3/N2-1","v":6.5999999999999392E-3},{"$f":"N$134/N2-1","v":1.0861625102673074},100.63,{"$f":"Q3/Q2-1","v":6.2999999999999723E-3},{"$f":"Q$134/Q2-1","v":1.0974730742364689},100.39,{"$f":"T3/T2-1","v":3.9000000000000146E-3},{"$f":"T$134/T2-1","v":1.0799889317144835},100.6,{"$f":"W3/W2-1","v":6.0000000000000053E-3},{"$f":"W$134/W2-1","v":1.6259166355535513},100.86,{"$f":"Z3/Z2-1","v":8.599999999999941E-3},{"$f":"Z$134/Z2-1","v":0.88010842018017588},100.88,{"$f":"AC3/AC2-1","v":8.799999999999919E-3},{"$f":"AC$134/AC2-1","v":0.89503701601059671},100,{"$f":"AF3/AF2-1","v":0},100,0,100,{"$f":"AJ3/AJ2-1","v":0},99.68,{"$f":"AL3/AL2-1","v":-3.1999999999999806E-3},99.67,{"$f":"AN3/AN2-1","v":-3.2999999999999696E-3},100,{"$f":"AP3/AP2-1","v":0},{"$f":"AP$134/AP2-1","v":0.12841080793958315},99.676000000000002,{"$f":"AS3/AS2-1","v":-3.2400000000000206E-3},{"$f":"AS$134/AS2-1","v":1.3141423634503919},{"$f":"AV2*(1+AW3)","v":100},0,{"$f":"AV$134/AV2-1","v":1.1124641740922314}]
["2013-02-01",101.44478400000003,5.2000000000000934E-3,0.85700675974284768,100.63098599999999,{"$f":"E4/E3-1","v":2.8999999999999027E-3},1.1871729040566987,100.51062000000002,2.0000000000000018E-3,1.1401572923997403,101.25389999999999,6.0000000000000053E-3,1.0726419367447417,101.43508199999999,7.7000000000000401E-3,1.0724841151075974,101.07277199999999,4.3999999999999595E-3,1.0843417213917013,101.19312000000001,8.0000000000000071E-3,1.0719084886089085,101.09293999999998,4.8999999999999044E-3,1.6102551049240073,101.46516,6.0000000000000053E-3,0.86407735492779691,101.56598399999999,6.7999999999999172E-3,0.87850616178687235,100.19,1.9000000000000128E-3,100,0,100,0,103.108992,3.4399999999999986E-2,103.427559,3.7700000000000067E-2,100.06333333333333,6.3333333333326358E-4,0.12841080793958315,{"$f":"0.4*AN4+0.6*AL4","v":103.2364188},3.5719920542557793E-2,1.3216645566138205,{"$f":"AV3*(1+AW4)","v":100},0,1.1124641740922314]
["2013-03-01",102.05345270400002,6.0000000000000053E-3,0.84740027829570974,100.84231107059999,2.0999999999999908E-3,1.1808484435703446,100.82220292200003,3.1000000000001027E-3,1.135885521357026,101.76016949999998,4.9999999999998934E-3,1.0602802552134611,101.9625444264,5.2000000000000934E-3,1.0566479260768058,101.55792130559998,4.7999999999999154E-3,1.075210793898548,101.47646073599999,2.7999999999999137E-3,1.0554647704453459,101.64895116999999,5.5000000000000604E-3,1.5975272215384693,101.94204625199998,4.6999999999999265E-3,0.8529595973437345,102.06365732159998,4.8999999999999044E-3,0.8658185953385702,100.28017099999998,8.9999999999990088E-4,100,0,100,0,103.16054649599999,4.9999999999994493E-4,107.36814899790001,3.8100000000000023E-2,100.09339033333333,3.003797594856028E-4,0.12769660009285766,104.84358749675999,1.5567846264345597E-2,1.2415949626590415,100,0,1.1124641740922314]
["2013-04-01",102.65556807495362,5.9000000000000163E-3,0.8363819863774451,100.9935745372059,1.5000000000000568E-3,1.1762782592259704,100.76170960024683,-6.0000000000004494E-4,1.1292847386671578,102.51319475429999,7.4000000000000732E-3,1.0500301046900113,102.9311885984508,9.5000000000000639E-3,1.0460086809359388,102.06571091212797,4.9999999999998934E-3,1.0652973665391601,102.32886300618239,8.3999999999999631E-3,1.0497255389363245,102.26900977213698,6.0999999999999943E-3,1.5833189672187657,102.50272750638599,5.5000000000000604E-3,0.84429142763385578,102.58418197394015,5.1000000000001044E-3,0.85672066408455616,98.836136537599984,-1.4399999999999968E-2,100,0,100,0,102.64474376352,-5.0000000000000044E-3,107.50772759159729,1.3000000000000789E-3,99.612045512533328,-4.8089571069279691E-3,0.12735796457860338,104.58993729475091,-2.4193201326396796E-3,1.2072330971332952,100,0,1.1124641740922314]
["2013-05-01",103.01486256321597,3.5000000000000586E-3,0.82561088217262668,100.9935745372059,0,1.1730187311292761,101.08414707096763,3.2000000000000917E-3,1.1305630765130656,104.81974163627173,2.2499999999999964E-2,1.0349713169446209,106.81169440861241,3.7700000000000067E-2,1.0267545130618512,102.71893146196558,6.3999999999999613E-3,1.0550222552628461,103.59774090745904,1.2399999999999967E-2,1.0326512682827493,102.8826238307698,6.0000000000000053E-3,1.5676562640083151,102.88198759815963,3.7000000000000366E-3,0.83420330943197962,103.05606921102027,4.5999999999999375E-3,0.84729943695607979,98.361723082219498,-4.8000000000000265E-3,100,0,100,0,102.27522268597131,-3.6000000000001586E-3,108.83007264097394,1.2299999999999978E-2,99.453907694073166,-1.5875371060447563E-3,0.13280557801376025,104.89716266797237,2.9374276452203141E-3,1.2125860511119479,105.25,5.2499999999999998E-2,1.1124641740922314]
["2013-06-01",103.30330417839296,2.7999999999999137E-3,0.81924352981826254,101.75102634623495,7.5000000000000622E-3,1.1730187311292761,101.85238658870699,7.6000000000000512E-3,1.1237670220425291,106.02516866508886,1.1500000000000066E-2,0.99019199701185423,108.67021789132228,1.7400000000000082E-2,0.95312182043158056,103.23252611927541,4.9999999999998934E-3,1.0419537512548156,105.62825662924524,1.9600000000000062E-2,1.0077551049809852,103.5102078361375,6.0999999999999943E-3,1.552342210743852,103.14948076591483,2.5999999999999357E-3,0.82744177486497916,103.44768227402216,3.8000000000000256E-3,0.83884076941676278,98.361723082219498,0,100.69999999999999,7.0000000000000001E-3,100,0,101.5797511717067,-6.8000000000000282E-3,108.20974122692039,-5.7000000000000384E-3,99.6872410274065,2.3461454531388259E-3,0.13460680842290262,104.23174719379217,-6.3435030772606149E-3,1.2061057750201236,105.25,0,1.0070918518691037]
["2013-07-01",103.16900988296105,-1.3000000000000789E-3,0.81416387097952003,102.01557901473515,2.5999999999999357E-3,1.1568424130315393,101.99497992993119,1.4000000000000679E-3,1.1077481362073534,106.53408947468127,4.7999999999999154E-3,0.96756499951740405,109.26790408972457,5.5000000000000604E-3,0.9197187147941619,103.6454562237525,4.0000000000000036E-3,1.0317947773679754,106.39934290263874,7.3000000000000842E-3,0.96915957726656066,104.25548133255769,7.2000000000000952E-3,1.5368673200912952,103.1804256101446,2.9999999999996696E-4,0.82270274772090501,103.52009565161396,6.9999999999992291E-4,0.83187962683479055,98.361723082219498,0,103.21749999999997,2.5000000000000001E-2,100,0,100.99058861491081,-5.8000000000000274E-3,109.02131428612229,7.5000000000000622E-3,100.52640769407316,8.4179947004046074E-3,0.13195108652806931,104.2028788833954,-2.7696274094979323E-4,1.2201895542898633,105.25,0,1.0070918518691037]
["2013-08-01",103.33408029877378,1.6000000000000458E-3,0.81652535393964176,102.16860238325727,1.5000000000000568E-3,1.1512491652020143,102.46415683760887,4.5999999999999375E-3,1.1048014142274347,106.86434515205279,3.1000000000001027E-3,0.95816580365983706,109.26790408972457,0,0.90921801570776895,104.32951623482927,6.5999999999999392E-3,1.023699977458143,106.72918086563693,3.1000000000001027E-3,0.95488888838137664,104.99569525001887,7.1000000000001062E-3,1.5187324464766632,103.42805863160893,2.3999999999999577E-3,0.82215610089063795,103.68572780465655,1.6000000000000458E-3,0.83059820808912832,98.361723082219498,0,103.21749999999997,0,100,0,100.38464508322134,-6.0000000000000053E-3,109.45739954326677,4.0000000000000036E-3,100.52640769407316,0,0.12250187172073002,104.01374686723952,-1.8150363807848402E-3,1.2208046344285286,105.25,0,1.0070918518691037]
{"$rows_left_out":181}
{"sheet":"3.1 Índice_EE","index":4,"n_rows":122,"n_cols":92,"rows_kept":122,"cut":false,"hidden":false,"merged":[[36,92,37,92],[35,62,35,65],[35,66,35,69],[35,70,35,73],[35,74,35,77],[35,78,35,81],[35,82,35,85],[34,89,37,89],[34,90,36,90],[34,91,37,91],[34,78,34,81],[34,82,34,85],[34,88,37,88],[34,62,34,65],[34,66,34,69],[34,70,34,73],[34,58,34,61],[35,54,35,57],[35,58,35,61],[35,50,35,53],[35,28,35,31],[35,32,35,35],[35,36,35,39],[35,40,35,43],[35,46,35,49],[34,45,37,45],[34,46,34,49],[34,28,34,31],[34,32,34,35],[34,36,34,39],[35,12,35,15],[35,16,35,19],[35,20,35,23],[35,24,35,27],[34,16,34,19],[34,20,34,23],[34,24,34,27],[34,1,37,1],[34,2,37,2],[34,3,37,3],[34,4,34,7],[34,8,34,11],[35,4,35,7],[35,8,35,11],[8,24,8,27],[8,28,8,31],[8,32,8,35],[8,36,8,39],[8,40,8,43],[34,74,34,77],[34,40,34,43],[9,4,9,7],[9,8,9,11],[9,12,9,15],[9,16,9,19],[9,20,9,23],[9,40,9,43],[33,70,33,77],[9,24,9,27],[9,28,9,31],[9,32,9,35],[9,36,9,39],[34,12,34,15],[34,50,34,53],[34,54,34,57],[8,20,8,23],[4,1,4,2],[8,4,8,7],[8,8,8,11],[8,12,8,15],[8,16,8,19]]}
["ARSAE-MG"]
["Cálculo da variação de preços de energia elétrica incorrida mês a mês (IEE mensal), para correção inflacionária das despesas com energia elétrica"]
[]
[]
[null,null,null,"Energia Elétrica - Cálculo da variação de preços incorrida mês a mês (IEE mensal), considerando variação de tarifas e bandeiras"]
[]
[null,null,null,"Perfil de consumo da Copasa (últimos 12 meses)"]
[null,null,null,null,"AES","AES","AES","AES","AES","AES","AES","AES","AES","AES","AES","AES","ADM","ADM","ADM","ADM","AES","AES","AES","AES","ADM","ADM","ADM","ADM","AES","AES","AES","AES","ADM","ADM","ADM","ADM","AES","AES","AES","AES","ADM","ADM","ADM","ADM"]
[null,null,null,null,"A2",null,null,null,"A3",null,null,null,"A4",null,null,null,"A4",null,null,null,"A4",null,null,null,"A4",null,null,null,"A4",null,null,null,"A4",null,null,null,"B3",null,null,null,"B3"]
[null,null,null,null,"AZ_AES",null,null,null,"AZ_AES",null,null,null,"AZ_AES",null,null,null,"AZ_ADM",null,null,null,"VD_AES",null,null,null,"VD_ADM",null,null,null,"EQ_AES",null,null,null,"EQ_ADM",null,null,null,"EQ_AES",null,null,null,"EQ_ADM"]
{"$rows_left_out":113}
{"sheet":"3.1.3.Tarifas_EE","index":5,"n_rows":135,"n_cols":46,"rows_kept":135,"cut":false,"hidden":false,"merged":[[2,1,5,1],[2,2,4,3],[2,4,2,7],[2,8,2,11],[2,12,2,15],[2,16,2,19],[3,4,3,7],[3,8,3,11],[3,12,3,15],[3,16,3,19],[3,32,3,35],[3,36,3,39],[3,40,3,43],[2,20,2,23],[2,24,2,27],[2,28,2,31],[2,32,2,35],[2,36,2,39],[2,40,2,43],[3,20,3,23],[3,24,3,27],[3,28,3,31]]}
[]
[null,null,null,null,"A2_AZ_D_P","A2_AZ_D_FP","A2_AZ_E_P","A2_AZ_E_FP","A3_AZ_D_P","A3_AZ_D_FP","A3_AZ_E_P","A3_AZ_E_FP","A4_AZ_D_P","A4_AZ_D_FP","A4_AZ_E_P","A4_AZ_E_FP","A4_AZ_D_P","A4_AZ_D_FP","A4_AZ_E_P","A4_AZ_E_FP","A4_VD_D_P","A4_VD_D","A4_VD_E_P","A4_VD_E_FP","A4_VD_D_P","A4_VD_D","A4_VD_E_P","A4_VD_E_FP","A4_EQ_D_P","A4_EQ_D","A4_EQ_E_P","A4_EQ_E","A4_EQ_D_P","A4_EQ_D","A4_EQ_E_P","A4_EQ_E","B3_EQ_D_P","B3_EQ_D","B3_EQ_E_P","B3_EQ_E","B3_EQ_D_P","B3_EQ_D","B3_EQ_E_P","B3_EQ_E"]
[null,"Mês","Bandeiras",null,"A2",null,null,null,"A3",null,null,null,"A4",null,null,null,"A4",null,null,null,"A4",null,null,null,"A4",null,null,null,"A4",null,null,null,"A4",null,null,null,"B3",null,null,null,"B3"]
[null,null,null,null,"AZ_AES",null,null,null,"AZ_AES",null,null,null,"AZ_AES",null,null,null,"AZ_ADM",null,null,null,"VD_AES",null,null,null,"VD_ADM",null,null,null,"EQ_AES",null,null,null,"EQ_ADM",null,null,null,"EQ_AES",null,null,null,"EQ_ADM"]
[null,null,null,null,"D_P","D_FP","E_P","E_FP","D_P","D_FP","E_P","E_FP","D_P","D_FP","E_P","E_FP","D_P","D_FP","E_P","E_FP","D_P","D_FP","E_P","E_FP","D_P","D_FP","E_P","E_FP","D_P","D_FP","E_P","E_FP","D_P","D_FP","E_P","E_FP","D_P","D_FP","E_P","E_FP","D_P","D_FP","E_P","E_FP"]
[null,null,"Cor","Valor","R$/kW","R$/kW","R$/MWh","R$/MWh","R$/kW","R$/kW","R$/MWh","R$/MWh","R$/kW","R$/kW","R$/MWh","R$/MWh","R$/kW","R$/kW","R$/MWh","R$/MWh","R$/kW","R$/kW","R$/MWh","R$/MWh","R$/kW","R$/kW","R$/MWh","R$/MWh","R$/kW","R$/kW","R$/MWh","R$/MWh","R$/kW","R$/kW","R$/MWh","R$/MWh","R$/kW","R$/kW","R$/MWh","R$/MWh","R$/kW","R$/kW","R$/MWh","R$/MWh"]
[null,"2015-04-01","Vermelha",5.5E-2,6.78,2.4500000000000002,435.52,297.39999999999998,17.88,5.47,446.87,308.75,30,9,447.88,309.76,30,9,447.88,309.76,null,9,1174.98,309.76,null,9,1174.98,309.76,null,30.6,null,321.27,null,30.6,null,321.27,null,null,null,509.74,null,null,null,509.74]
[null,"2015-05-01","Vermelha",5.5E-2,6.78,2.4500000000000002,435.52,297.39999999999998,17.88,5.47,446.87,308.75,30,9,447.88,309.76,30,9,447.88,309.76,null,9,1174.98,309.76,null,9,1174.98,309.76,null,30.6,null,321.27,null,30.6,null,321.27,null,null,null,509.74,null,null,null,509.74]
[null,"2015-06-01","Vermelha",5.5E-2,6.78,2.4500000000000002,435.52,297.39999999999998,17.88,5.47,446.87,308.75,30,9,447.88,309.76,30,9,447.88,309.76,null,9,1174.98,309.76,null,9,1174.98,309.76,null,30.6,null,321.27,null,30.6,null,321.27,null,null,null,509.74,null,null,null,509.74]
[null,"2015-07-01","Vermelha",5.5E-2,6.78,2.4500000000000002,435.52,297.39999999999998,17.88,5.47,446.87,308.75,30,9,447.88,309.76,30,9,447.88,309.76,null,9,1174.98,309.76,null,9,1174.98,309.76,null,30.6,null,321.27,null,30.6,null,321.27,null,null,null,509.74,null,null,null,509.74]
{"$rows_left_out":126}
{"sheet":"4.Componentes Financeiros","index":6,"n_rows":135,"n_cols":20,"rows_kept":135,"cut":false,"hidden":false,"merged":[]}
["ARSAE-MG "]
["Gerência de Regulação Tarifária (GRT)"]
["Componentes Financeiros Copasa 2023"]
[]
[]
[]
[null,null,null,null,"Componentes financeiros (Reajuste 2023)",null,null,null,null,{"$f":"D9","v":1},{"$f":"E9","v":"Compensação itens não administráveis"}]
[null,null,null,null,"Componentes Financeiros (CF)","Valor em R$",null,null,null,null,"Mês","Energia Elétrica","Material de Tratamento","Combustíveis e Lubrificantes","Telecomunicações","Tributos e outras obrigações","Compensação Total","Selic Mensal","Selic Acumulada","Compensação Total com Selic"]
[null,null,null,1,"Compensação itens não administráveis",{"$f":"T21","v":46456303.37962532},null,null,null,null,"2022-09-01",1849886.1205016444,762682.63882105239,124383.89321899186,-42121.822524450436,4428312.4222455956,{"$f":"SUM(L9:P9)","v":7123143.2522628345},1.0699999999999999E-2,{"$f":"(1+S10)*(1+R9)-1","v":0.18153219562402523},{"$f":"Q9*(1+S9)","v":8416223.0865905657}]
[null,null,null,2,"Compensação Tarifa Social",{"$f":"Q33","v":6263930.0971575957},null,null,null,null,"2022-10-01",1641132.6809535013,621112.26524978108,44448.962982064848,-17527.454471520203,7868389.5049754344,{"$f":"SUM(L10:P10)","v":10157555.959689261},1.0200000000000001E-2,0.16902364264769498,{"$f":"Q10*(1+S10)","v":11874423.068393743}]
{"$rows_left_out":126}
{"sheet":"5.Subsídio_Copanor","index":7,"n_rows":15,"n_cols":15,"rows_kept":15,"cut":false,"hidden":false,"merged":[[5,3,6,12]]}
["ARSAE-MG "]
["Gerência de Regulação Tarifária (GRT)"]
["SUBSÍDIO COPANOR - Cálculo do aumento na tarifa da Copasa para investimentos e manutenção na Copanor"]
[]
[]
[null,null,null,"Aqui é calculado o valor a ser repassado à Copanor + um adicional refererente à incidência de IRPJ e CSLL. O adicional para pagamento de PIS/Cofins é feito no cálculo geral da receita tarifária. Eventuais impactos sobre pagamentos de PLR e JCP são custeados pela Copasa, sem efeito sobre as tarifas."]
[]
[null,null,null,null,null,null,null,null,null,"Receita Tarifária base",{"$f":"copiar_RTbase_FQ","v":7253945913.3822031}]
[null,null,null,null,null,null,null,null,null,"Aumento alocado na tarifa",60175012.18657808,null,{"$f":"K9/K8","v":8.2954867468154388E-3}]
[null,null,null,null,null,null,null,null,null," (-) PIS e Cofins",{"$f":"9.25%*K9","v":5566188.6272584721}]
{"$rows_left_out":6}
{"sheet":"5.1.Sub_Copanor_comp","index":8,"n_rows":21,"n_cols":15,"rows_kept":21,"cut":false,"hidden":false,"merged":[[6,3,7,12]]}
["ARSAE-MG "]
["Gerência de Regulação Tarifária (GRT)",null,null,null,null,null,null,null,null,null,null,null,null,null,"Macro para cálculo circular"]
["SUBSÍDIO COPANOR - Cálculo da devolução aos usuários por subexecução de investimentos em 2022"]
["Reajuste 2023"]
[]
[null,null,null,null,null,null,null,null,null,null,null,null,null,null,{"$f":"N2=0","v":true}]
[null,null,null,"Ao devolver o valor referente a investimentos não executados, é devolvido também o acréscimo que tinha sido recebido para pagamento de IRPJ e CSLL. Os efeitos sobre PIS/Pasep e Cofins ocorrem naturalmente no cálculo geral das tarifas."]
[]
[]
[null,null,null,null,null,null,null,null,null,"Valor devolvido",-10237583.401811507,null,null,{"$f":"K10-K16","v":-10237583.401811507}]
{"$rows_left_out":12}
{"sheet":"6.Compen_quota_depreciacao","index":9,"n_rows":59,"n_cols":74,"rows_kept":59,"cut":false,"hidden":false,"merged":[[21,29,21,40],[21,42,21,53],[49,1,55,28],[7,68,7,72],[8,3,8,14],[8,16,8,27],[8,29,8,40],[8,42,8,53],[8,68,8,72],[18,68,18,72],[21,3,21,14],[21,16,21,27]]}
["ARSAE-MG"]
["Detalhamento do cálculo da compensação referente à quota de depreciação (em razão das diferenças entre valores previstos e realizados de investimentos em reposição de ativos)"]
["2023-10-27"]
[]
[]
[null,"WACC","WACC mensal"]
[null,7.9240410012754406E-2,{"$f":"B7/12","v":6.6033675010628672E-3}]
[null,"Valor residual e amortização da BRE no ciclo 2021-2025 (valores considerados na RTP 2021)"]
[null,null,"Ano 1","Ano 1",null,null,null,null,null,null,null,null,null,null,null,"Ano 2","Ano 2",null,null,null,null,null,null,null,null,null,null,null,"Ano 3","Ano 3",null,null,null,null,null,null,null,null,null,null,null,"Ano 4","Ano 4",null,null,null,null,null,null,null,null,null,null,null,null,null,null,null,null,null,null,null,null,null,null,null,null,null,"VALORES CONSIDERADOS NA RTP 2021 E NOS REAJUSTES DO CICLO"]
[null,"Referência valor residual:","ref.: dez/20","mês 1","mês 2","mês 3","mês 4","mês 5","mês 6","mês 7","mês 8","mês 9","mês 10","mês 11","mês 12","ref.: dez/21","mês 1","mês 2","mês 3","mês 4","mês 5","mês 6","mês 7","mês 8","mês 9","mês 10","mês 11","mês 12","ref.: dez/22","mês 1","mês 2","mês 3","mês 4","mês 5","mês 6","mês 7","mês 8","mês 9","mês 10","mês 11","mês 12","ref.: dez/23","mês 1","mês 2","mês 3","mês 4","mês 5","mês 6","mês 7","mês 8","mês 9","mês 10","mês 11","mês 12",null,null,null,null,null,null,null,null,null,null,null,null,null,null,null,"RTP 2021","Reaj. 22","Reaj. 23","Reaj. 24"]
{"$rows_left_out":49}