{"text_format":"1","workbook":"xlsx","n_sheets":11,"sheets":["Sumário","1.Anterior (IRT_2019)","2.IRT_2020","3.1.Índices_inflação","3.2.TFAS","3.3.EE_Índice","3.3.3.Tarifas_EE","4.Componentes Financeiros","5.Subsídio_Copanor","5.Sub_Copanor_comp","6.Compensação JCP"],"not_rendered":{"charts":0,"images":6,"macros":1,"external_links":23,"defined_names":533,"comments":6,"pivot_tables":0},"unopened":[],"bounds":{"document_bytes":16777216,"sheet_cells":100000,"rows_first":2000,"rows_last":500,"rows_between":2000,"halvings":0,"cell_chars":16384,"cell_head_chars":4096},"cells_cut":0,"cells_raw":0,"read":"whole","date_system":"1900"}

{"sheet":"Sumário","index":0,"n_rows":38,"n_cols":20,"rows_kept":38,"cut":false,"hidden":false,"merged":[[6,1,7,12],[9,1,9,19],[37,1,37,19]]}
["ARSAE-MG "]
["Gerência de Regulação Tarifária (GRT)"]
["Data: 10/04/2020"]
["Cálculo do Índice de Reajuste Tarifário (IRT) e Efeito Tarifário Médio (ETM) - Reajuste Tarifário da Copasa - 2020"]
[]
[]
[null,"    Esta planilha contém cálculos referentes ao reajuste tarifário anual da Copasa - 2020",null,null,null,null,null,null,null,null,null,null,null,null,null,null,null,"PR0:",{"$f":"EDATE(S8,-12)","v":"2019-08-01"},{"$f":"EDATE(S7,11)","v":"2020-07-01"}]
[null,null,null,null,null,null,null,null,null,null,null,null,null,null,null,null,null,"PR1:","2020-08-01",{"$f":"EDATE(S8,11)","v":"2021-07-01"}]
{"$rows_left_out":31}
{"sheet":"1.Anterior (IRT_2019)","index":1,"n_rows":57,"n_cols":24,"rows_kept":57,"cut":false,"hidden":false,"merged":[[52,1,52,2],[51,1,51,2],[51,3,51,16],[13,1,32,1],[13,2,26,2],[33,1,37,1],[38,1,42,1],[45,1,48,1],[1,10,1,11],[52,3,52,16],[0,19,0,20],[1,19,1,20],[2,19,2,20],[3,19,3,20],[2,15,2,16]]}
["ARSAE-MG ",null,null,null,null,null,null,null,null,null,"WACC regulatório",7.9440073977179892E-2,null,null,null,null,"Receita op. 2018 sem resíduos sólidos",4465133440,null,"Receita operacional (sem resíduos sólidos) jan a abr de 2019",null,1581098229.9200001]
["Gerência de Regulação Tarifária (GRT)",null,null,null,null,null,"PR0:",{"$f":"EDATE(H3,-12)","v":"2018-08-01"},{"$f":"EDATE(H2,11)","v":"2019-07-01"},null,"Itens calculados sobre a RT ou CO (% a.a.)",null,null,null,null,null,"Receita op. 2019 sem resíduos sólidos (estimativa)",4908841166.7116604,null,"Receita acima proporcionalizada para 7 meses (jan-jul)",null,2766921902.3600001]
["Data: 22/05/2019",null,null,null,null,null,"PR1:","2019-08-01",{"$f":"EDATE(H3,11)","v":"2020-07-01"},null,"PIS e Cofins",6.4600990008600104E-2,null,null,null,"Receita a considerar",null,4723962947.2484684,null,"Receita acima atualizada pelo ETM e proporc. p/ 5 meses (ago-dez)",null,2141919264.3516598]
["Cálculo do Índice de Reajuste Tarifário (IRT) e Efeito Tarifário Médio (ETM) - Reajuste Tarifário da Copasa - 2019",null,null,null,null,null,null,null,null,null,"Proteção de Mananciais",5.0000000000000001E-3,null,null,null,null,null,null,null,"Estimativa da RO 2019",null,4908841166.7116604]
[null,null,null,null,null,null,null,null,null,null,"NCG",2.461953170611025E-2]
[null,null,null,null,"Antes mudança estrutura tarifária","Variação Mercado","Após mudança estrutura tarifária",null,null,null,"Receitas irrecuperáveis",2.0160463232708738E-2]
[null,null,null,"Receita Base PR0",4854069098.9761791,-6.0679182119877106E-3,4853789131.4123554,null,null,null,"Incentivo atendimento telefônico",2.2137439391175955E-2]
[null,null,null,"Receita de Aplicação PR0",4815734557.0352573,-6.0414565562028066E-3,4815715215.6271152,null,null,null,"Fator de Qualidade (FQ)",-4.5766948672950197E-3]
{"$rows_left_out":50}
{"sheet":"2.IRT_2020","index":2,"n_rows":141,"n_cols":26,"rows_kept":141,"cut":false,"hidden":false,"merged":[[137,4,138,5],[1,11,1,13],[45,2,48,2],[11,5,11,6],[11,7,11,11],[38,2,42,2],[13,2,32,2],[33,2,37,2],[13,3,26,3],[11,12,11,17],[55,14,55,15],[51,4,51,17],[52,4,52,17],[53,12,53,17],[7,15,7,16],[3,15,3,17]]}
["ARSAE-MG ",null,null,null,null,null,null,null,null,null,null,"WACC regulatório",7.9440073977179892E-2]
["Gerência de Regulação Tarifária (GRT)",null,null,null,null,null,null,null,null,null,null,"Itens calculados sobre a RT ou CO (% a.a.)",null,null,null,null,null,null,0,"Previsão da RO 2020"]
["Data: 20/05/2020",null,null,null,null,null,null,null,null,null,null,"PIS e Cofins",null,{"$f":"'1.Anterior (IRT_2019)'!L3","v":6.4600990008600104E-2},null,null,null,null,0,878572284.29999971,"Receita jan-fev/20"]
[{"$f":"Sumário!A4","v":"Cálculo do Índice de Reajuste Tarifário (IRT) e Efeito Tarifário Médio (ETM) - Reajuste Tarifário da Copasa - 2020"},null,null,null,null,null,null,null,null,null,null,"Proteção de Mananciais",null,5.0000000000000001E-3,null,"Receita para proteção de mananciais",null,null,0,{"$f":"T3/2*7","v":3075002995.0499992},"Receita acima proporcionalizada para 7 meses (jan-jul)"]
[null,null,null,null,null,null,null,null,null,null,null,"NCG",null,{"$f":"'1.Anterior (IRT_2019)'!L5","v":2.461953170611025E-2},null,null,"RO 2019 sem resíduos sólidos",5049030158.8900003,null,{"$f":"T4*(1+T54)/7*5","v":2263112584.9793139},"Receita acima atualizada pelo ETM e proporcionalizada para 5 meses (ago-dez)"]
[null,"Legenda:",null,null,null,"Antes mudança estrutura tarifária",null,"Após mudança estrutura tarifária",null,null,null,"Receitas irrecuperáveis",null,{"$f":"'1.Anterior (IRT_2019)'!L6","v":2.0160463232708738E-2},null,null,"Receita operacional 2020",{"$f":"T6","v":5338115580.0293131},null,{"$f":"T4+T5","v":5338115580.0293131},"Estimativa da RO 2020"]
[null,"Entrada de dados",null,null,"RT0 base",5265754458.9664927,{"$f":"F7/'1.Anterior (IRT_2019)'!Q50-1","v":4.2205780647711855E-2},5266458509.1750126,{"$f":"H7/F7-1","v":1.3370357733277771E-4},null,null,"Incentivo atendimento telefônico",null,3.1194619999999999E-2,null,null,"RO 2020 sem resíduos sólidos",{"$f":"SUM(R6:R6)","v":5338115580.0293131}]
[null,"Destaque",null,null,"RT0 aplicação",5439366058.0568762,{"$f":"F8/'1.Anterior (IRT_2019)'!R53-1","v":4.2201070409337849E-2},5439382566.728322,{"$f":"H8/F8-1","v":3.0350359343511712E-6},null,null,"Fator de Qualidade (FQ)",null,8.9896711233141864E-3,null,"RO para aplicar 0,5% mananciais",null,{"$f":"5/12*R5+7/12*R6","v":5217663321.2212658},{"$f":"R8/'1.Anterior (IRT_2019)'!R3-1","v":0.10450978965877789}]
{"$rows_left_out":134}
{"sheet":"3.1.Índices_inflação","index":3,"n_rows":132,"n_cols":36,"rows_kept":132,"cut":false,"hidden":false,"merged":[[130,0,131,0]]}
["Mês","INPC","Δ%","IGP-M","Δ%","IGP-DI","Δ%","INCC","Δ%","INCC-DI MB","Δ%","INCC-DI MS","Δ%","INCC-M","Δ%","SELIC","Δ%","IPCA","Δ%","IPCA 15","Δ%","IPCA BH Fixo","Δ%","IPCA BH Cel","Δ%","IPCA BH Int","Δ%","IPCA BH Gas","Δ%","IPCA BH Die","Δ%","IPCA BH Tel","Δ%","IPCA BH Comb","Δ%"]
["2012-12-01",100,null,100,null,100,null,100,null,100,null,100,null,100,null,100,null,100,null,100,null,100,null,100,null,100,null,100,null,100,null,{"$f":"AVERAGE(V2,X2,Z2)","v":100},null,{"$f":"0.4*AD2+0.6*AB2","v":100}]
["2013-01-01",100.92000000000002,{"$f":"B3/B2-1","v":9.200000000000097E-3},100.34,{"$f":"D3/D2-1","v":3.4000000000000696E-3},100.31000000000002,{"$f":"F3/F2-1","v":3.1000000000001027E-3},100.64999999999999,{"$f":"H3/H2-1","v":6.4999999999999503E-3},100.66,{"$f":"J3/J2-1","v":6.5999999999999392E-3},100.63,{"$f":"L3/L2-1","v":6.2999999999999723E-3},100.39,{"$f":"N3/N2-1","v":3.9000000000000146E-3},100.6,{"$f":"P3/P2-1","v":6.0000000000000053E-3},100.86,{"$f":"R3/R2-1","v":8.599999999999941E-3},100.88,{"$f":"T3/T2-1","v":8.799999999999919E-3},100,{"$f":"V3/V2-1","v":0},100,{"$f":"X3/X2-1","v":0},100,{"$f":"Z3/Z2-1","v":0},99.68,{"$f":"AB3/AB2-1","v":-3.1999999999999806E-3},99.67,{"$f":"AD3/AD2-1","v":-3.2999999999999696E-3},{"$f":"AVERAGE(V3,X3,Z3)","v":100},{"$f":"AF3/AF2-1","v":0},{"$f":"0.4*AD3+0.6*AB3","v":99.676000000000002},{"$f":"AH3/AH2-1","v":-3.2400000000000206E-3}]
["2013-02-01",101.44478400000003,{"$f":"B4/B3-1","v":5.2000000000000934E-3},100.63098599999999,2.8999999999999027E-3,100.51062000000002,2.0000000000000018E-3,101.25389999999999,6.0000000000000053E-3,101.43508199999999,7.7000000000000401E-3,101.07277199999999,4.3999999999999595E-3,101.19312000000001,8.0000000000000071E-3,101.09293999999998,4.8999999999999044E-3,101.46516,6.0000000000000053E-3,101.56598399999999,6.7999999999999172E-3,100.19,1.9000000000000128E-3,100,0,100,0,103.108992,3.4399999999999986E-2,103.427559,3.7700000000000067E-2,{"$f":"AVERAGE(V4,X4,Z4)","v":100.06333333333333},6.3333333333326358E-4,{"$f":"0.4*AD4+0.6*AB4","v":103.2364188},3.5719920542557793E-2]
["2013-03-01",102.05345270400002,6.0000000000000053E-3,100.84231107059999,2.0999999999999908E-3,100.82220292200003,3.1000000000001027E-3,101.76016949999998,4.9999999999998934E-3,101.9625444264,5.2000000000000934E-3,101.55792130559998,4.7999999999999154E-3,101.47646073599999,2.7999999999999137E-3,101.64895116999999,5.5000000000000604E-3,101.94204625199998,4.6999999999999265E-3,102.06365732159998,4.8999999999999044E-3,100.28017099999998,8.9999999999990088E-4,100,0,100,0,103.16054649599999,4.9999999999994493E-4,107.36814899790001,3.8100000000000023E-2,100.09339033333333,3.003797594856028E-4,104.84358749675999,1.5567846264345597E-2]
["2013-04-01",102.65556807495362,5.9000000000000163E-3,100.9935745372059,1.5000000000000568E-3,100.76170960024683,-6.0000000000004494E-4,102.51319475429999,7.4000000000000732E-3,102.9311885984508,9.5000000000000639E-3,102.06571091212797,4.9999999999998934E-3,102.32886300618239,8.3999999999999631E-3,102.26900977213698,6.0999999999999943E-3,102.50272750638599,5.5000000000000604E-3,102.58418197394015,5.1000000000001044E-3,98.836136537599984,-1.4399999999999968E-2,100,0,100,0,102.64474376352,-5.0000000000000044E-3,107.50772759159729,1.3000000000000789E-3,99.612045512533328,-4.8089571069279691E-3,{"$f":"0.4*AD6+0.6*AB6","v":104.58993729475091},-2.4193201326396796E-3]
["2013-05-01",103.01486256321597,3.5000000000000586E-3,100.9935745372059,0,101.08414707096763,3.2000000000000917E-3,104.81974163627173,2.2499999999999964E-2,106.81169440861241,3.7700000000000067E-2,102.71893146196558,6.3999999999999613E-3,103.59774090745904,1.2399999999999967E-2,102.8826238307698,6.0000000000000053E-3,102.88198759815963,3.7000000000000366E-3,103.05606921102027,4.5999999999999375E-3,98.361723082219498,-4.8000000000000265E-3,100,0,100,0,102.27522268597131,-3.6000000000001586E-3,108.83007264097394,1.2299999999999978E-2,99.453907694073166,-1.5875371060447563E-3,104.89716266797237,2.9374276452203141E-3]
["2013-06-01",103.30330417839296,2.7999999999999137E-3,101.75102634623495,7.5000000000000622E-3,101.85238658870699,7.6000000000000512E-3,106.02516866508886,1.1500000000000066E-2,108.67021789132228,1.7400000000000082E-2,103.23252611927541,4.9999999999998934E-3,105.62825662924524,1.9600000000000062E-2,103.5102078361375,6.0999999999999943E-3,103.14948076591483,2.5999999999999357E-3,103.44768227402216,3.8000000000000256E-3,98.361723082219498,0,100.69999999999999,6.9999999999998952E-3,100,0,101.5797511717067,-6.8000000000000282E-3,108.20974122692039,-5.7000000000000384E-3,99.6872410274065,2.3461454531388259E-3,104.23174719379217,-6.3435030772606149E-3]
{"$rows_left_out":125}
{"sheet":"3.2.TFAS","index":4,"n_rows":32,"n_cols":22,"rows_kept":32,"cut":false,"hidden":false,"merged":[[5,13,5,14],[23,10,23,11],[5,10,5,11],[5,7,5,8]]}
["ARSAE-MG"]
["2019-04-10",null,"TFAS"]
[null,null,"Cálculo da TFAS prevista para o próximo PR e da variação necessária na parcela da tarifa destinada para essa despesa. Essa variação alimenta a plan. 2 na coluna de inflação prevista (%)"]
[]
[]
[null,null,null,"IGP-DI",null,null,null,{"$f":"CONCATENATE(TEXT(\"Estimativa TFAS \",),TEXT(Sumário!T8,\"aaaa\"))","v":"Estimativa TFAS 2021"},null,null,"TFAS - PR0",null,null,"Estimativa TFAS - PR1",null,null,null,"TFAS anual Copasa 2019 (Resolução Arsae 119, de 15 de janeiro de 2019):"]
[null,null,{"$f":"EDATE(C8,-1)","v":"2018-10-01"},{"$f":"IFERROR(VLOOKUP(C7,'3.1.Índices_inflação'!A:AI,6,FALSE),D6*(1+B7))","v":140.74869288385059},null,null,null,"Ufemg 2020",3.7115999999999998,null,{"$f":"Sumário!S7","v":"2019-08-01"},{"$f":"$R$8","v":3129018.4791666665},null,{"$f":"Sumário!S8","v":"2020-08-01"},{"$f":"$R$12","v":3283981.5316666667},null,null,37548221.75]
[null,null,{"$f":"EDATE(C9,-1)","v":"2018-11-01"},{"$f":"IFERROR(VLOOKUP(C8,'3.1.Índices_inflação'!A:AI,6,FALSE),D7*(1+B8))","v":139.14415778497471},null,null,null,"Ufemg 2021",{"$f":"I7*(1+E31)","v":3.9850570916312185},null,{"$f":"EDATE(K7,1)","v":"2019-09-01"},{"$f":"$R$8","v":3129018.4791666665},null,{"$f":"EDATE(N7,1)","v":"2020-09-01"},{"$f":"$R$12","v":3283981.5316666667},null,null,{"$f":"R7/12","v":3129018.4791666665},"mensal"]
{"$rows_left_out":25}
{"sheet":"3.3.EE_Índice","index":5,"n_rows":77,"n_cols":148,"rows_kept":77,"cut":false,"hidden":false,"merged":[[44,90,46,90],[55,139,55,143],[57,139,57,143],[58,139,58,143],[49,140,49,141],[49,142,49,143],[50,140,50,141],[50,142,50,143],[51,140,51,141],[51,142,51,143],[52,140,52,141],[52,142,52,143],[54,139,54,143],[27,139,28,141],[27,142,28,144],[27,146,29,146],[27,147,29,147],[5,131,7,131],[5,132,7,132],[5,134,7,134],[26,134,28,134],[5,130,7,130],[26,130,28,130],[7,136,8,136],[26,133,29,133],[6,125,6,128],[27,63,27,66],[27,67,27,70],[27,71,27,74],[27,75,27,78],[27,79,27,82],[27,83,27,86],[26,83,26,86],[26,63,26,66],[26,67,26,70],[26,71,26,74],[26,125,26,128],[26,105,26,108],[26,109,26,112],[26,113,26,116],[26,117,26,120],[26,121,26,124],[6,121,6,124],[6,105,6,108],[6,109,6,112],[6,113,6,116],[6,117,6,120],[6,101,6,104],[6,63,6,66],[5,125,5,128],[5,133,8,133],[5,105,5,108],[5,109,5,112],[5,113,5,116],[26,135,28,135],[26,132,28,132],[27,89,27,92],[27,93,27,96],[27,97,27,100],[27,101,27,104],[27,105,27,108],[27,109,27,112],[26,97,26,100],[26,89,26,92],[26,93,26,96],[5,101,5,104],[5,117,5,120],[5,121,5,124],[27,113,27,116],[27,117,27,120],[27,121,27,124],[27,125,27,128],[26,131,28,131],[27,3,27,6],[27,7,27,10],[27,11,27,14],[27,15,27,18],[27,19,27,22],[27,23,27,26],[27,27,27,30],[27,31,27,34],[26,101,26,104],[26,75,26,78],[26,79,26,82],[26,51,26,54],[26,55,26,58],[26,59,26,62],[27,35,27,38],[27,39,27,42],[27,47,27,50],[27,51,27,54],[27,55,27,58],[27,59,27,62],[6,23,6,26],[26,23,26,26],[26,27,26,30],[26,31,26,34],[26,35,26,38],[26,39,26,42],[26,47,26,50],[6,79,6,82],[6,83,6,86],[6,35,6,38],[6,39,6,42],[6,47,6,50],[6,51,6,54],[6,55,6,58],[6,59,6,62],[6,27,6,30],[6,31,6,34],[1,0,1,1],[5,3,5,6],[5,7,5,10],[5,11,5,14],[5,15,5,18],[5,19,5,22],[26,3,26,6],[26,7,26,10],[26,11,26,14],[26,15,26,18],[26,19,26,22],[6,15,6,18],[6,19,6,22],[6,3,6,6],[6,7,6,10],[6,11,6,14],[5,23,5,26],[5,27,5,30],[5,31,5,34],[5,35,5,38],[5,39,5,42],[5,47,5,50],[6,89,6,92],[6,93,6,96],[6,97,6,100],[5,75,5,78],[5,79,5,82],[5,83,5,86],[5,89,5,92],[5,93,5,96],[5,97,5,100],[5,51,5,54],[5,55,5,58],[5,59,5,62],[5,63,5,66],[5,67,5,70],[5,71,5,74],[6,67,6,70],[6,71,6,74],[6,75,6,78]]}
["ARSAE-MG",null,null,null,null,null,null,null,null,null,null,null,null,null,null,null,null,null,null,null,null,null,null,null,null,null,null,null,null,null,null,null,null,null,null,null,null,null,null,null,null,null,null,null,"Valores para procv:",2,3,4,5,6,7,8,9,10,11,12,13,14,15,16,17,18,19,20,21,22,23,24,25,26,27,28,29,30,31,32,33,34,35,36,37,38,39,40,41,42,43]
["2019-04-10",null,null,"Cálculo do índice de Energia Elétrica"]
[null,null,null,null,null,null,null,null,null,null,null,null,null,null,null,null,null,null,null,null,null,null,null,null,null,null,null,null,null,null,null,null,null,null,null,null,null,null,null,null,null,null,null,null,null,null,null,null,null,null,null,null,null,null,null,null,null,null,null,null,null,null,null,null,null,null,null,null,null,null,null,null,null,null,null,null,null,null,null,null,null,null,null,null,null,null,null,null,"para energia",1,1,1000,1000,1,1,1000,1000,1,1,1000,1000,1,1,1000,1000,1,1,1000,1000,1,1,1000,1000,1,1,1000,1000,1,1,1000,1000,1,1,1000,1000,1,1,1000,1000]
[null,null,null,"Perfil de consumo da Copasa no PR0 "]
[null,null,null,"AES","AES","AES","AES","AES","AES","AES","AES","AES","AES","AES","AES","ADM","ADM","ADM","ADM","AES","AES","AES","AES","ADM","ADM","ADM","ADM","AES","AES","AES","AES","ADM","ADM","ADM","ADM","AES","AES","AES","AES","ADM","ADM","ADM","ADM",null,null,null,null,{"$f":"CONCATENATE(TEXT(\"Tarifas observadas de \",),TEXT(Sumário!S7,\"MMM/AA\"),TEXT(\" - \",),TEXT(Sumário!T7,\"MMM/AA\"))","v":"Tarifas observadas de ago/19 - jul/20"},null,null,null,null,null,null,null,null,null,null,null,null,null,null,null,null,null,null,null,null,null,null,null,null,null,null,null,null,null,null,null,null,null,null,null,null,null,null,null,null,null,{"$f":"CONCATENATE(TEXT(\"Faturamento simulado com tarifas vigentes no período \",),TEXT(Sumário!S7,\"MMM/AA\"),TEXT(\" - \",),TEXT(Sumário!T7,\"MMM/AA\"))","v":"Faturamento simulado com tarifas vigentes no período ago/19 - jul/20"}]
[null,null,null,"A2",null,null,null,"A3",null,null,null,"A4",null,null,null,"A4",null,null,null,"A4",null,null,null,"A4",null,null,null,"A4",null,null,null,"A4",null,null,null,"B3",null,null,null,"B3",null,null,null,null,null,null,null,"A2",null,null,null,"A3",null,null,null,"A4",null,null,null,"A4",null,null,null,"A4",null,null,null,"A4",null,null,null,"A4",null,null,null,"A4",null,null,null,"B3",null,null,null,"B3",null,null,null,null,null,"A2",null,null,null,"A3",null,null,null,"A4",null,null,null,"A4",null,null,null,"A4",null,null,null,"A4",null,null,null,"A4",null,null,null,"A4",null,null,null,"B3",null,null,null,"B3",null,null,null,null,"TOTAL sem bandeiras",null,"Bandeiras",null,"TOTAL com bandeiras"]
[null,null,null,"AZ_AES",null,null,null,"AZ_AES",null,null,null,"AZ_AES",null,null,null,"AZ_ADM",null,null,null,"VD_AES",null,null,null,"VD_ADM",null,null,null,"EQ_AES",null,null,null,"EQ_ADM",null,null,null,"EQ_AES",null,null,null,"EQ_ADM",null,null,null,null,null,null,null,"AZ_AES",null,null,null,"AZ_AES",null,null,null,"AZ_AES",null,null,null,"AZ_ADM",null,null,null,"VD_AES",null,null,null,"VD_ADM",null,null,null,"EQ_AES",null,null,null,"EQ_ADM",null,null,null,"EQ_AES",null,null,null,"EQ_ADM",null,null,null,null,null,"AZ_AES",null,null,null,"AZ_AES",null,null,null,"AZ_AES",null,null,null,"AZ_ADM",null,null,null,"VD_AES",null,null,null,"VD_ADM",null,null,null,"EQ_AES",null,null,null,"EQ_ADM",null,null,null,"EQ_AES",null,null,null,"EQ_ADM"]
[null,null,null,"D_P","D_FP","E_P","E_FP","D_P","D_FP","E_P","E_FP","D_P","D_FP","E_P","E_FP","D_P","D_FP","E_P","E_FP","D_P","D_FP","E_P","E_FP","D_P","D_FP","E_P","E_FP","D_P","D_FP","E_P","E_FP","D_P","D_FP","E_P","E_FP","D_P","D_FP","E_P","E_FP","D_P","D_FP","E_P","E_FP",null,null,null,null,"D_P","D_FP","E_P","E_FP","D_P","D_FP","E_P","E_FP","D_P","D_FP","E_P","E_FP","D_P","D_FP","E_P","E_FP","D_P","D_FP","E_P","E_FP","D_P","D_FP","E_P","E_FP","D_P","D_FP","E_P","E_FP","D_P","D_FP","E_P","E_FP","D_P","D_FP","E_P","E_FP","D_P","D_FP","E_P","E_FP",null,null,"D_P","D_FP","E_P","E_FP","D_P","D_FP","E_P","E_FP","D_P","D_FP","E_P","E_FP","D_P","D_FP","E_P","E_FP","D_P","D_FP","E_P","E_FP","D_P","D_FP","E_P","E_FP","D_P","D_FP","E_P","E_FP","D_P","D_FP","E_P","E_FP","D_P","D_FP","E_P","E_FP","D_P","D_FP","E_P","E_FP"]
{"$rows_left_out":70}
{"sheet":"3.3.3.Tarifas_EE","index":6,"n_rows":104,"n_cols":46,"rows_kept":104,"cut":false,"hidden":false,"merged":[[3,32,3,35],[3,36,3,39],[3,40,3,43],[2,20,2,23],[2,24,2,27],[2,28,2,31],[2,32,2,35],[2,36,2,39],[2,40,2,43],[3,20,3,23],[3,24,3,27],[3,28,3,31],[2,12,2,15],[2,16,2,19],[3,4,3,7],[3,8,3,11],[3,12,3,15],[3,16,3,19],[2,1,5,1],[2,2,4,3],[2,4,2,7],[2,8,2,11],[86,7,86,9]]}
[null,"Tarifas efetivas","Cemig"]
[]
[null,"Mês","Bandeiras",null,"A2",null,null,null,"A3",null,null,null,"A4",null,null,null,"A4",null,null,null,"A4",null,null,null,"A4",null,null,null,"A4",null,null,null,"A4",null,null,null,"B3",null,null,null,"B3"]
[null,null,null,null,"AZ_AES",null,null,null,"AZ_AES",null,null,null,"AZ_AES",null,null,null,"AZ_ADM",null,null,null,"VD_AES",null,null,null,"VD_ADM",null,null,null,"EQ_AES",null,null,null,"EQ_ADM",null,null,null,"EQ_AES",null,null,null,"EQ_ADM"]
[null,null,null,null,"D_P","D_FP","E_P","E_FP","D_P","D_FP","E_P","E_FP","D_P","D_FP","E_P","E_FP","D_P","D_FP","E_P","E_FP","D_P","D_FP","E_P","E_FP","D_P","D_FP","E_P","E_FP","D_P","D_FP","E_P","E_FP","D_P","D_FP","E_P","E_FP","D_P","D_FP","E_P","E_FP","D_P","D_FP","E_P","E_FP"]
[null,null,"Cor","Valor","R$/kW","R$/kW","R$/MWh","R$/MWh","R$/kW","R$/kW","R$/MWh","R$/MWh","R$/kW","R$/kW","R$/MWh","R$/MWh","R$/kW","R$/kW","R$/MWh","R$/MWh","R$/kW","R$/kW","R$/MWh","R$/MWh","R$/kW","R$/kW","R$/MWh","R$/MWh","R$/kW","R$/kW","R$/MWh","R$/MWh","R$/kW","R$/kW","R$/MWh","R$/MWh","R$/kW","R$/kW","R$/MWh","R$/MWh","R$/kW","R$/kW","R$/MWh","R$/MWh"]
[null,"2015-04-01","Vermelha",5.5E-2,6.78,2.4500000000000002,435.52,297.39999999999998,17.88,5.47,446.87,308.75,30,9,447.88,309.76,30,9,447.88,309.76,null,9,1174.98,309.76,null,9,1174.98,309.76,null,30.6,null,321.27,null,30.6,null,321.27,null,null,null,509.74,null,null,null,509.74]
[null,"2015-05-01","Vermelha",5.5E-2,6.78,2.4500000000000002,435.52,297.39999999999998,17.88,5.47,446.87,308.75,30,9,447.88,309.76,30,9,447.88,309.76,null,9,1174.98,309.76,null,9,1174.98,309.76,null,30.6,null,321.27,null,30.6,null,321.27,null,null,null,509.74,null,null,null,509.74]
{"$rows_left_out":97}
{"sheet":"4.Componentes Financeiros","index":7,"n_rows":41,"n_cols":14,"rows_kept":41,"cut":false,"hidden":false,"merged":[[28,4,28,5],[7,10,7,11]]}
["ARSAE-MG "]
["Gerência de Regulação Tarifária (GRT)"]
["Data: 13/04/2020"]
["Componentes Financeiros Copasa 2020"]
[]
[]
[null,null,null,null,"Componentes financeiros 2020",null,null,null,null,null,{"$f":"CONCATENATE(TEXT(\"Impacto da variação de mercado sobre os CF do PR anterior - \",),TEXT(Sumário!S7,\"AAAA\"))","v":"Impacto da variação de mercado sobre os CF do PR anterior - 2019"}]
[null,null,null,null,"Componentes Financeiros (CF)","Valor em R$",null,null,null,null,"Descrição",null,"Valor"]
{"$rows_left_out":34}
{"sheet":"5.Subsídio_Copanor","index":8,"n_rows":90,"n_cols":18,"rows_kept":90,"cut":false,"hidden":false,"merged":[[70,1,88,1],[70,3,71,12],[80,3,81,12],[5,3,6,12],[15,3,16,12],[5,1,23,1],[25,1,43,1],[25,3,26,12],[35,3,36,12],[46,1,64,1],[46,3,47,12],[56,3,57,12]]}
["ARSAE-MG "]
["Coordenadoria Econômica",null,null,null,null,null,null,null,null,null,null,null,null,{"$f":"K35+K45+K80+K90","v":0},{"$f":"N2=0","v":true}]
["SUBSÍDIO COPANOR - Cálculo do aumento na tarifa da Copasa para investimento na Copanor"]
[]
[]
[null,"Revisão 2017",null,"Para a Copasa repassar o adicional arrecadado após dedução dos percentuais de PIS/Cofins, IR e CSLL, e utilizar recursos da sua geração de caixa para o pagamento de PLR e JCP:"]
[null,null,null,null,null,null,null,null,null,null,null,null,null,null,57389935.611724474,1.2355621353723603E-2]
[null,null,null,null,null,null,null,null,null,"Receita Tarifária base",4514466140.1574202,null,null,null,57389935.611724474,{"$f":"O8=O7","v":true}]
{"$rows_left_out":83}
{"sheet":"5.Sub_Copanor_comp","index":9,"n_rows":90,"n_cols":16,"rows_kept":90,"cut":false,"hidden":false,"merged":[[70,1,88,1],[70,3,71,12],[80,3,81,12]]}
["ARSAE-MG "]
["Coordenadoria Econômica",null,null,null,null,null,null,null,null,null,null,null,null,{"$f":"K35+K45+K80+K90","v":0},{"$f":"N2=0","v":true}]
["SUBSÍDIO COPANOR - Cálculo da devolução aos usuários por subexecução em 2019"]
["Reajuste 2020"]
[]
[]
[]
[]
{"$rows_left_out":83}
{"sheet":"6.Compensação JCP","index":10,"n_rows":45,"n_cols":9,"rows_kept":45,"cut":false,"hidden":false,"merged":[[6,1,6,2],[20,1,20,2],[11,5,11,6]]}
["ARSAE-MG"]
["Cálculo do valor a ser compensado nas tarifas de ago/20 a jul/21 relativo à dedutibilidade do JCP da base de tributos sobre o lucro"]
["Data: 19/05/2020"]
[]
[]
[]
[null,"Estimativa dos tributos sobre o lucro e outros desembolsos, considerando distribuição de proventos em forma de JCP ",null,null,null,"Compensação JCP",{"$f":"G11-G16","v":8.9406967163085938E-8}]
[null,"   Total de Custos de capital que compõe a Receita Tarifária de aplicação (RT0 aplic)",{"$f":"'1.Anterior (IRT_2019)'!R43*(1+'2.IRT_2020'!G8)","v":2325563272.7116852},null,null,"Descrição","Valor"]
{"$rows_left_out":37}